{"text_format":"1","workbook":"xlsx","n_sheets":13,"sheets":["MANUÁL","Titul","Výsledková listina","Rozstřely a tresty","Absolutní-BODY","Liga-kolo-M","Liga-kolo-Z","Liga-kolo-S","Liga-kolo-J","Liga-kolo-Jz","Liga-celkem","typ turnaje","seznam"],"not_rendered":{"charts":0,"images":1,"macros":1,"external_links":0,"defined_names":33,"comments":0,"pivot_tables":0},"unopened":[],"bounds":{"document_bytes":16777216,"sheet_cells":100000,"rows_first":2000,"rows_last":500,"rows_between":2000,"halvings":0,"cell_chars":16384,"cell_head_chars":4096},"cells_cut":0,"cells_raw":0,"read":"whole","date_system":"1900"}

{"sheet":"MANUÁL","index":0,"n_rows":22,"n_cols":2,"rows_kept":22,"cut":false,"hidden":false,"merged":[]}
[null,"!!! NEUPRAVUJTE TO, NECHTE FORMÁTY JAK JSOU !!!"]
[null,"POVOLIT MAKRA"]
[null,"Výsledková listina používá \"bodování RAK\""]
["BODOVÁNÍ"]
["-","v listu \"typ turnaje\" označit typ turnaje"]
["-","v listu \"Absolutní-BODY\" vyplňovat pouze kolonku \"reg\" (registrační číslo - všechny aktuální data jsou doplněny z listu \"seznam\" podle vepsaného registračního čísla)"]
[null,"pokud jméno nesouhlasí s Protokolem, je špatně na Protokolu vypsané reg.číslo"]
["-","v listu \"Absolutní-BODY\" pak už jen dopisovat jednotlivá kola"]
["-","během turnaje si lze seřazovat hráče dle, Start.čísla, Absolutního pořadí, nebo Kategorií"]
["-","po skončení turnaje a dle potřeby použít pro \"4 kola\", nebo \"8 kol\""]
["-","v případě potřeby změnit skutečné pořadí v kategoriích (rozstřely) v listu \"Výsledková listina\""]
["-","rozstřely a tresty se zapisují zvlášť do listu \"Rozstřely a tresty\""]
["-","v listu \"Titul\" doplnit Název turnaje, místo, povrch, datum, pořadatele, vedení turnaje, rozhodčí, jury."]
["-","v případě cizích hráčů v listu \"seznam\" doplnit hráče na konec seznamu a napsat mu jakékoliv 5místné číslo, které se pak používá místo reg.čísla"]
["LIGA"]
["-","v listech \"Liga-kolo-X\" doplnit název klubu a pouze kolonku \"reg\" (jméno a odehrátá kola se doplňují z listu \"seznam\" a \"bodování\")"]
["-","v listech \"Liga-kolo-X\" okruhy náhradníků, nebo případné střídání nutno vymazat či opravit ručně"]
["-","po dohrátí okruhů, vše v listech \"Liga-kolo-X\" označit, kopírovat a následně vložit jako hodnoty. Vymažou se vzorce a již napsané se nezmění."]
["-","v listu \"Liga-celkem\" doplnit jednotlivé a celkové výsledky družstev"]
["STARTOVNÉ"]
["-","v listu \"startovné\" pouze vyplnit částku u kategorií (zelené pole)"]
["-","svůj klub jen vymazat název a napsat ho dolů do zeleného pole (musí být napsaný stejně). Bude to počítat počet hráčů, ale nebude se to plést do vybraného startovného"]

{"sheet":"Titul","index":1,"n_rows":35,"n_cols":2,"rows_kept":35,"cut":false,"hidden":false,"merged":[[32,1,32,7],[34,1,34,7],[10,0,10,7],[14,0,14,7],[18,0,18,7],[20,0,20,7],[28,1,28,7],[30,1,30,7]]}
[]
[]
[]
[]
[]
[]
[]
[]
[]
[]
["Výsledková listina"]
[]
[]
[]
["3. Open Chomutov + 2.liga smíš.družstev"]
[]
[]
[]
["2013-05-05"]
[]
["SKDG Chomutov"]
[]
[]
[]
[]
[]
[]
[]
["Ředitel turnaje:","Zdeněk Drozda"]
[]
["Hlavní rozhodčí:","Milan Bláha"]
[]
["Rozhodčí:","Vladimír Fiedler,  Miroslav Lisa st."]
[]
["Jury:","Zdeněk Drozda, Milan Bláha, Lumír Benda, Jan Hála, František Nečekal st."]

{"sheet":"Výsledková listina","index":2,"n_rows":76,"n_cols":43,"rows_kept":76,"cut":false,"hidden":false,"merged":[]}
[null,null,"Absolutní pořadí - Muži",null,null,null,null,null,null,null,null,null,null,null,null,null,null,null,null,null,null,null,null,null,"Absolutní pořadí - Ženy"]
["poř.","st.č.","příjmení","oddíl","reg","vt","kat.","1","2","3","4","5","6","7","8","Sum","prům.","r1","r2","kol","BODY",null,"poř.","st.č.","příjmení","oddíl","reg","vt","kat.","1","2","3","4","5","6","7","8","Sum","prům.","r1","r2","kol","BODY"]
[1,27,"Souček Milan","GC 85 Rakovník",1101,1,"S",24,26,21,24,null,null,null,null,95,23.75,5,0,4,67,null,1,2,"Dočkalová Jana","SKGC Frant. Lázně",1689,1,"Z",25,28,24,23,null,null,null,null,100,25,5,1,4,62]
[2,14,"Moutvička Ondřej","MGC Plzeň",2503,2,"M",23,23,23,28,null,null,null,null,97,24.25,5,0,4,65,"r",2,7,"Dočkalová Dana","SKGC Frant. Lázně",1388,"M","Se",27,27,26,26,null,null,null,null,106,26.5,1,1,4,56]
[3,20,"Dočkal Lubomír ml.","SKGC Frant. Lázně",1791,"bez","M",27,22,24,24,null,null,null,null,97,24.25,5,0,4,65,"r",3,22,"Fiedlerová Jaroslava","SKGC Frant. Lázně",1478,"M","Se",29,26,25,27,null,null,null,null,107,26.75,4,1,4,55]
[4,15,"Malárik Michal","SKGC Frant. Lázně",3475,1,"J",26,28,20,24,null,null,null,null,98,24.5,8,2,4,64,null,4,42,"Vosmíková Petra","GC 85 Rakovník",986,1,"Z",27,28,29,25,null,null,null,null,109,27.25,4,1,4,53]
[5,12,"Hála Jan","SKGC Frant. Lázně",230,"M","S2",25,23,27,24,null,null,null,null,99,24.75,4,1,4,63,null,5,11,"Brettlová Jana","SKDG Jesenice",2570,2,"Z",30,26,29,26,null,null,null,null,111,27.75,4,3,4,51]
[6,4,"Míka Jiří","MGC Plzeň",2164,2,"M",24,26,25,26,null,null,null,null,101,25.25,2,1,4,61,null,6,36,"Kadlecová Eva","TJ MG Cheb",3535,4,"Z",33,29,32,31,null,null,null,null,125,31.25,4,1,4,37]
[7,3,"Mráz Josef","SK DG Chomutov",408,3,"S",26,24,28,24,null,null,null,null,102,25.5,4,2,4,60,null,7,24,"Birešová Vlasta","SKGC Frant. Lázně",526,2,"Se",31,34,31,30,null,null,null,null,126,31.5,4,0,4,36]
[8,35,"Vitner Václav","GC 85 Rakovník",1134,2,"S",29,24,24,26,null,null,null,null,103,25.75,5,2,4,59,null,8,23,"Kubantová Lucie","SK DG Chomutov",3011,5,"Z",36,34,31,29,null,null,null,null,130,32.5,7,3,4,32]
[9,18,"Mandák Josef","SK DG Chomutov",809,2,"S",24,28,26,26,null,null,null,null,104,26,4,0,4,58,null,9,33,"Fiedlerová Jana","SKGC Frant. Lázně",3521,2,"Z",31,37,33,35,null,null,null,null,136,34,6,2,4,26]
[10,19,"Benda Lumír","MGC Plzeň",746,1,"S",27,22,28,28,null,null,null,null,105,26.25,6,1,4,57,null,10,29,"Zachová Marcela","SK DG Chomutov",2918,3,"Se",43,37,28,35,null,null,null,null,143,35.75,15,2,4,19]
[11,17,"Bireš Jan","SKGC Frant. Lázně",652,"M","S2",28,27,24,27,null,null,null,null,106,26.5,4,0,4,56,null,null,null,"Ženy"]
[12,16,"Lisa Miroslav st.","SKDG Jesenice",433,1,"S2",27,28,27,26,null,null,null,null,108,27,2,0,4,54,null,"poř.","st.č.","příjmení","oddíl","reg","vt","kat.","1","2","3","4","5","6","7","8","Sum","prům.","r1","r2","kol","BODY"]
[13,5,"Horáček Vlastislav","SKGC Frant. Lázně",233,4,"S",27,28,26,27,null,null,null,null,108,27,2,0,4,54,null,1,2,"Dočkalová Jana","SKGC Frant. Lázně",1689,1,"Z",25,28,24,23,null,null,null,null,100,25,5,1,4,62]
[14,8,"Drozda Zdeněk","SK DG Chomutov",1324,3,"M",25,26,30,28,null,null,null,null,109,27.25,5,2,4,53,null,2,42,"Vosmíková Petra","GC 85 Rakovník",986,1,"Z",27,28,29,25,null,null,null,null,109,27.25,4,1,4,53]
[15,10,"Beran Robert","SKGC Frant. Lázně",1150,3,"S",31,31,24,26,null,null,null,null,112,28,7,5,4,50,null,3,11,"Brettlová Jana","SKDG Jesenice",2570,2,"Z",30,26,29,26,null,null,null,null,111,27.75,4,3,4,51]
[16,13,"Pajkov Mitko","SK DG Chomutov",2318,3,"M",30,26,27,32,null,null,null,null,115,28.75,6,3,4,47,null,4,36,"Kadlecová Eva","TJ MG Cheb",3535,4,"Z",33,29,32,31,null,null,null,null,125,31.25,4,1,4,37]
[17,25,"Wolf Jan","TJ MG Cheb",3051,1,"M",32,30,28,26,null,null,null,null,116,29,6,2,4,46,null,5,23,"Kubantová Lucie","SK DG Chomutov",3011,5,"Z",36,34,31,29,null,null,null,null,130,32.5,7,3,4,32]
[18,41,"Mansfeld Martin","TJ MG Cheb",2403,4,"M",31,34,27,24,null,null,null,null,116,29,10,4,4,46,null,6,33,"Fiedlerová Jana","SKGC Frant. Lázně",3521,2,"Z",31,37,33,35,null,null,null,null,136,34,6,2,4,26]
[19,40,"Luxa Radek","GC 85 Rakovník",3066,2,"M",31,29,29,28,null,null,null,null,117,29.25,3,0,4,45,null,null,null,"Seniorky"]
[20,9,"Moutvička Jaroslav","MGC Plzeň",2502,2,"S",28,32,30,27,null,null,null,null,117,29.25,5,2,4,45,null,"poř.","st.č.","příjmení","oddíl","reg","vt","kat.","1","2","3","4","5","6","7","8","Sum","prům.","r1","r2","kol","BODY"]
[21,38,"Kropáček Václav","GC 85 Rakovník",202,2,"S",28,30,28,33,null,null,null,null,119,29.75,5,2,4,43,null,1,7,"Dočkalová Dana","SKGC Frant. Lázně",1388,"M","Se",27,27,26,26,null,null,null,null,106,26.5,1,1,4,56]
[22,1,"Gruncl Josef","SKDG Jesenice",1278,3,"S",29,30,32,31,null,null,null,null,122,30.5,3,1,4,40,null,2,22,"Fiedlerová Jaroslava","SKGC Frant. Lázně",1478,"M","Se",29,26,25,27,null,null,null,null,107,26.75,4,1,4,55]
[23,30,"Fiedler Vladimír","SKGC Frant. Lázně",1416,2,"M",31,29,33,31,null,null,null,null,124,31,4,0,4,38,null,3,24,"Birešová Vlasta","SKGC Frant. Lázně",526,2,"Se",31,34,31,30,null,null,null,null,126,31.5,4,0,4,36]
[24,6,"Wenzl Daniel","SKDG Jesenice",712,3,"S",28,33,34,29,null,null,null,null,124,31,6,4,4,38,null,4,29,"Zachová Marcela","SK DG Chomutov",2918,3,"Se",43,37,28,35,null,null,null,null,143,35.75,15,2,4,19]
[25,28,"Kocum Ondřej","TJ MG Cheb",3552,3,"M",28,26,37,34,null,null,null,null,125,31.25,11,6,4,37,null,null,null,"Juniorky"]
[26,31,"Bláha Milan","GC 85 Rakovník",1099,2,"S",33,28,28,39,null,null,null,null,128,32,11,5,4,34,null,"poř.","st.č.","příjmení","oddíl","reg","vt","kat.","1","2","3","4","5","6","7","8","Sum","prům.","r1","r2","kol","BODY"]
[27,39,"Hubinger Miroslav","MG České údolí Plzeň 3",442,5,"S",30,32,33,34,null,null,null,null,129,32.25,4,1,4,33,null,null,null,"Žákyně"]
[28,32,"Kadlec Jan","TJ MG Cheb",3536,2,"Jz",34,32,34,31,null,null,null,null,131,32.75,3,2,4,31,null,"poř.","st.č.","příjmení","oddíl","reg","vt","kat.","1","2","3","4","5","6","7","8","Sum","prům.","r1","r2","kol","BODY"]
[29,37,"Nečekal František st.","TJ MG Cheb",238,1,"S2",34,28,34,38,null,null,null,null,134,33.5,10,0,4,28]
[30,34,"Kratochvíl Jaroslav","SKDG Jesenice",235,2,"S2",33,37,34,33,null,null,null,null,137,34.25,4,1,4,25]
[31,21,"Cimerman Jan","SKDG Jesenice",2396,4,"M",30,42,35,31,null,null,null,null,138,34.5,12,4,4,24]
[32,26,"Cimerman Jaroslav","SKDG Jesenice",2395,4,"S2",39,38,32,39,null,null,null,null,148,37,7,1,4,14]
[null,null,"Muži"]
["poř.","st.č.","příjmení","oddíl","reg","vt","kat.","1","2","3","4","5","6","7","8","Sum","prům.","r1","r2","kol","BODY"]
[1,14,"Moutvička Ondřej","MGC Plzeň",2503,2,"M",23,23,23,28,null,null,null,null,97,24.25,5,0,4,65,"r"]
[2,20,"Dočkal Lubomír ml.","SKGC Frant. Lázně",1791,"bez","M",27,22,24,24,null,null,null,null,97,24.25,5,0,4,65,"r"]
[3,4,"Míka Jiří","MGC Plzeň",2164,2,"M",24,26,25,26,null,null,null,null,101,25.25,2,1,4,61]
[4,8,"Drozda Zdeněk","SK DG Chomutov",1324,3,"M",25,26,30,28,null,null,null,null,109,27.25,5,2,4,53]
[5,13,"Pajkov Mitko","SK DG Chomutov",2318,3,"M",30,26,27,32,null,null,null,null,115,28.75,6,3,4,47]
[6,25,"Wolf Jan","TJ MG Cheb",3051,1,"M",32,30,28,26,null,null,null,null,116,29,6,2,4,46]
[7,41,"Mansfeld Martin","TJ MG Cheb",2403,4,"M",31,34,27,24,null,null,null,null,116,29,10,4,4,46]
[8,40,"Luxa Radek","GC 85 Rakovník",3066,2,"M",31,29,29,28,null,null,null,null,117,29.25,3,0,4,45]
[9,30,"Fiedler Vladimír","SKGC Frant. Lázně",1416,2,"M",31,29,33,31,null,null,null,null,124,31,4,0,4,38]
[10,28,"Kocum Ondřej","TJ MG Cheb",3552,3,"M",28,26,37,34,null,null,null,null,125,31.25,11,6,4,37]
[11,21,"Cimerman Jan","SKDG Jesenice",2396,4,"M",30,42,35,31,null,null,null,null,138,34.5,12,4,4,24]
[null,null,"Senioři"]
["poř.","st.č.","příjmení","oddíl","reg","vt","kat.","1","2","3","4","5","6","7","8","Sum","prům.","r1","r2","kol","BODY"]
[1,27,"Souček Milan","GC 85 Rakovník",1101,1,"S",24,26,21,24,null,null,null,null,95,23.75,5,0,4,67]
[2,3,"Mráz Josef","SK DG Chomutov",408,3,"S",26,24,28,24,null,null,null,null,102,25.5,4,2,4,60]
[3,35,"Vitner Václav","GC 85 Rakovník",1134,2,"S",29,24,24,26,null,null,null,null,103,25.75,5,2,4,59]
[4,18,"Mandák Josef","SK DG Chomutov",809,2,"S",24,28,26,26,null,null,null,null,104,26,4,0,4,58]
[5,19,"Benda Lumír","MGC Plzeň",746,1,"S",27,22,28,28,null,null,null,null,105,26.25,6,1,4,57]
[6,5,"Horáček Vlastislav","SKGC Frant. Lázně",233,4,"S",27,28,26,27,null,null,null,null,108,27,2,0,4,54]
[7,10,"Beran Robert","SKGC Frant. Lázně",1150,3,"S",31,31,24,26,null,null,null,null,112,28,7,5,4,50]
[8,9,"Moutvička Jaroslav","MGC Plzeň",2502,2,"S",28,32,30,27,null,null,null,null,117,29.25,5,2,4,45]
[9,38,"Kropáček Václav","GC 85 Rakovník",202,2,"S",28,30,28,33,null,null,null,null,119,29.75,5,2,4,43]
[10,1,"Gruncl Josef","SKDG Jesenice",1278,3,"S",29,30,32,31,null,null,null,null,122,30.5,3,1,4,40]
[11,6,"Wenzl Daniel","SKDG Jesenice",712,3,"S",28,33,34,29,null,null,null,null,124,31,6,4,4,38]
[12,31,"Bláha Milan","GC 85 Rakovník",1099,2,"S",33,28,28,39,null,null,null,null,128,32,11,5,4,34]
[13,39,"Hubinger Miroslav","MG České údolí Plzeň 3",442,5,"S",30,32,33,34,null,null,null,null,129,32.25,4,1,4,33]
[null,null,"Senioři2"]
["poř.","st.č.","příjmení","oddíl","reg","vt","kat.","1","2","3","4","5","6","7","8","Sum","prům.","r1","r2","kol","BODY"]
[1,12,"Hála Jan","SKGC Frant. Lázně",230,"M","S2",25,23,27,24,null,null,null,null,99,24.75,4,1,4,63]
[2,17,"Bireš Jan","SKGC Frant. Lázně",652,"M","S2",28,27,24,27,null,null,null,null,106,26.5,4,0,4,56]
[3,16,"Lisa Miroslav st.","SKDG Jesenice",433,1,"S2",27,28,27,26,null,null,null,null,108,27,2,0,4,54]
[4,37,"Nečekal František st.","TJ MG Cheb",238,1,"S2",34,28,34,38,null,null,null,null,134,33.5,10,0,4,28]
[5,34,"Kratochvíl Jaroslav","SKDG Jesenice",235,2,"S2",33,37,34,33,null,null,null,null,137,34.25,4,1,4,25]
[6,26,"Cimerman Jaroslav","SKDG Jesenice",2395,4,"S2",39,38,32,39,null,null,null,null,148,37,7,1,4,14]
[null,null,"Junioři"]
["poř.","st.č.","příjmení","oddíl","reg","vt","kat.","1","2","3","4","5","6","7","8","Sum","prům.","r1","r2","kol","BODY"]
[1,15,"Malárik Michal","SKGC Frant. Lázně",3475,1,"J",26,28,20,24,null,null,null,null,98,24.5,8,2,4,64]
[null,null,"Žáci"]
["poř.","st.č.","příjmení","oddíl","reg","vt","kat.","1","2","3","4","5","6","7","8","Sum","prům.","r1","r2","kol","BODY"]
[1,32,"Kadlec Jan","TJ MG Cheb",3536,2,"Jz",34,32,34,31,null,null,null,null,131,32.75,3,2,4,31]

{"sheet":"Rozstřely a tresty","index":3,"n_rows":4,"n_cols":6,"rows_kept":4,"cut":false,"hidden":false,"merged":[]}
[null,"Muži"]
["poř.","příjmení","oddíl","reg","kat.","údery na drahách"]
[1,{"$f":"IF(D3=0,\"\",VLOOKUP($D3,seznam!$A$2:$F$5009,2,FALSE))","v":"Moutvička Ondřej"},{"$f":"IF(D3=0,\"\",VLOOKUP($D3,seznam!$A$2:$F$5009,3,FALSE))","v":"MGC Plzeň"},2503,{"$f":"IF(D3=0,\"\",VLOOKUP($D3,seznam!$A$2:$F$5009,5,FALSE))","v":"M"},1]
[2,{"$f":"IF(D4=0,\"\",VLOOKUP($D4,seznam!$A$2:$F$5009,2,FALSE))","v":"Dočkal Lubomír ml."},{"$f":"IF(D4=0,\"\",VLOOKUP($D4,seznam!$A$2:$F$5009,3,FALSE))","v":"SKGC Frant. Lázně"},1791,{"$f":"IF(D4=0,\"\",VLOOKUP($D4,seznam!$A$2:$F$5009,5,FALSE))","v":"M"},2]

{"sheet":"Absolutní-BODY","index":4,"n_rows":161,"n_cols":24,"rows_kept":161,"cut":false,"hidden":false,"merged":[[0,23,0,27]]}
["poř.","st.č.","příjmení","oddíl","reg","vt","kat.","1","2","3","4","5","6","7","8","Sum","prům.","r1","r2","kol","BODY",{"$f":"VLOOKUP(1,'typ turnaje'!$B$3:$D$23,2,FALSE)","v":"Open"},null,"SEŘAZENÍ DLE:"]
[{"$f":"IF(E2=0,\"\",1)","v":1},27,{"$f":"IF(E2=0,\"\",VLOOKUP($E2,seznam!$A$2:$F$5009,2,FALSE))","v":"Souček Milan"},{"$f":"IF(E2=0,\"\",VLOOKUP($E2,seznam!$A$2:$F$5009,3,FALSE))","v":"GC 85 Rakovník"},1101,{"$f":"IF(E2=0,\"\",VLOOKUP($E2,seznam!$A$2:$F$5009,4,FALSE))","v":1},{"$f":"IF(E2=0,\"\",VLOOKUP($E2,seznam!$A$2:$F$5009,5,FALSE))","v":"S"},24,26,21,24,null,null,null,null,{"$f":"IF(E2=0,\"\",SUM(H2:O2))","v":95},{"$f":"IF(E2=0,\"\",+P2/COUNT(H2:O2))","v":23.75},{"$f":"IF(E2=0,\"\",MAX($H2:$O2)-MIN($H2:$O2))","v":5},{"$f":"IF(E2=0,\"\",LARGE($H2:$O2,2)-SMALL($H2:$O2,2))","v":0},{"$f":"IF(E2=0,\"\",+COUNT(H2:O2))","v":4},{"$f":"IF(E2=0,\"\",IF(ROUND('typ turnaje'!$G$24+(+$V$3-$Q2)/'typ turnaje'!$H$24,0)>0,ROUND('typ turnaje'!$G$24+(+$V$3-$Q2)/'typ turnaje'!$H$24,0),0))","v":67},{"$f":"VLOOKUP(1,'typ turnaje'!$B$3:$D$23,3,FALSE)","v":"mtg"}]
[{"$f":"IF(E3=0,\"\",A2+1)","v":2},14,{"$f":"IF(E3=0,\"\",VLOOKUP($E3,seznam!$A$2:$F$5009,2,FALSE))","v":"Moutvička Ondřej"},{"$f":"IF(E3=0,\"\",VLOOKUP($E3,seznam!$A$2:$F$5009,3,FALSE))","v":"MGC Plzeň"},2503,{"$f":"IF(E3=0,\"\",VLOOKUP($E3,seznam!$A$2:$F$5009,4,FALSE))","v":2},{"$f":"IF(E3=0,\"\",VLOOKUP($E3,seznam!$A$2:$F$5009,5,FALSE))","v":"M"},23,23,23,28,null,null,null,null,97,24.25,5,0,4,{"$f":"IF(E3=0,\"\",IF(ROUND('typ turnaje'!$G$24+(+$V$3-$Q3)/'typ turnaje'!$H$24,0)>0,ROUND('typ turnaje'!$G$24+(+$V$3-$Q3)/'typ turnaje'!$H$24,0),0))","v":65},{"$f":"SUM(INDEX(Q2:Q21,MATCH(A2,A2:A21),1):INDEX(Q2:Q21,MATCH('typ turnaje'!F24,A2:A21),1))/'typ turnaje'!F24","v":24.416666666666668}]
[3,20,{"$f":"IF(E4=0,\"\",VLOOKUP($E4,seznam!$A$2:$F$5009,2,FALSE))","v":"Dočkal Lubomír ml."},{"$f":"IF(E4=0,\"\",VLOOKUP($E4,seznam!$A$2:$F$5009,3,FALSE))","v":"SKGC Frant. Lázně"},1791,{"$f":"IF(E4=0,\"\",VLOOKUP($E4,seznam!$A$2:$F$5009,4,FALSE))","v":"bez"},{"$f":"IF(E4=0,\"\",VLOOKUP($E4,seznam!$A$2:$F$5009,5,FALSE))","v":"M"},27,22,24,24,null,null,null,null,97,24.25,5,0,4,{"$f":"IF(E4=0,\"\",IF(ROUND('typ turnaje'!$G$24+(+$V$3-$Q4)/'typ turnaje'!$H$24,0)>0,ROUND('typ turnaje'!$G$24+(+$V$3-$Q4)/'typ turnaje'!$H$24,0),0))","v":65}]
[4,15,{"$f":"IF(E5=0,\"\",VLOOKUP($E5,seznam!$A$2:$F$5009,2,FALSE))","v":"Malárik Michal"},{"$f":"IF(E5=0,\"\",VLOOKUP($E5,seznam!$A$2:$F$5009,3,FALSE))","v":"SKGC Frant. Lázně"},3475,{"$f":"IF(E5=0,\"\",VLOOKUP($E5,seznam!$A$2:$F$5009,4,FALSE))","v":1},{"$f":"IF(E5=0,\"\",VLOOKUP($E5,seznam!$A$2:$F$5009,5,FALSE))","v":"J"},26,28,20,24,null,null,null,null,98,24.5,8,2,4,{"$f":"IF(E5=0,\"\",IF(ROUND('typ turnaje'!$G$24+(+$V$3-$Q5)/'typ turnaje'!$H$24,0)>0,ROUND('typ turnaje'!$G$24+(+$V$3-$Q5)/'typ turnaje'!$H$24,0),0))","v":64}]
[5,12,{"$f":"IF(E6=0,\"\",VLOOKUP($E6,seznam!$A$2:$F$5009,2,FALSE))","v":"Hála Jan"},{"$f":"IF(E6=0,\"\",VLOOKUP($E6,seznam!$A$2:$F$5009,3,FALSE))","v":"SKGC Frant. Lázně"},230,{"$f":"IF(E6=0,\"\",VLOOKUP($E6,seznam!$A$2:$F$5009,4,FALSE))","v":"M"},{"$f":"IF(E6=0,\"\",VLOOKUP($E6,seznam!$A$2:$F$5009,5,FALSE))","v":"S2"},25,23,27,24,null,null,null,null,99,24.75,4,1,4,{"$f":"IF(E6=0,\"\",IF(ROUND('typ turnaje'!$G$24+(+$V$3-$Q6)/'typ turnaje'!$H$24,0)>0,ROUND('typ turnaje'!$G$24+(+$V$3-$Q6)/'typ turnaje'!$H$24,0),0))","v":63}]
[6,2,{"$f":"IF(E7=0,\"\",VLOOKUP($E7,seznam!$A$2:$F$5009,2,FALSE))","v":"Dočkalová Jana"},{"$f":"IF(E7=0,\"\",VLOOKUP($E7,seznam!$A$2:$F$5009,3,FALSE))","v":"SKGC Frant. Lázně"},1689,{"$f":"IF(E7=0,\"\",VLOOKUP($E7,seznam!$A$2:$F$5009,4,FALSE))","v":1},{"$f":"IF(E7=0,\"\",VLOOKUP($E7,seznam!$A$2:$F$5009,5,FALSE))","v":"Z"},25,28,24,23,null,null,null,null,100,25,5,1,4,{"$f":"IF(E7=0,\"\",IF(ROUND('typ turnaje'!$G$24+(+$V$3-$Q7)/'typ turnaje'!$H$24,0)>0,ROUND('typ turnaje'!$G$24+(+$V$3-$Q7)/'typ turnaje'!$H$24,0),0))","v":62}]
[7,4,{"$f":"IF(E8=0,\"\",VLOOKUP($E8,seznam!$A$2:$F$5009,2,FALSE))","v":"Míka Jiří"},{"$f":"IF(E8=0,\"\",VLOOKUP($E8,seznam!$A$2:$F$5009,3,FALSE))","v":"MGC Plzeň"},2164,{"$f":"IF(E8=0,\"\",VLOOKUP($E8,seznam!$A$2:$F$5009,4,FALSE))","v":2},{"$f":"IF(E8=0,\"\",VLOOKUP($E8,seznam!$A$2:$F$5009,5,FALSE))","v":"M"},24,26,25,26,null,null,null,null,101,25.25,2,1,4,{"$f":"IF(E8=0,\"\",IF(ROUND('typ turnaje'!$G$24+(+$V$3-$Q8)/'typ turnaje'!$H$24,0)>0,ROUND('typ turnaje'!$G$24+(+$V$3-$Q8)/'typ turnaje'!$H$24,0),0))","v":61}]
[8,3,{"$f":"IF(E9=0,\"\",VLOOKUP($E9,seznam!$A$2:$F$5009,2,FALSE))","v":"Mráz Josef"},{"$f":"IF(E9=0,\"\",VLOOKUP($E9,seznam!$A$2:$F$5009,3,FALSE))","v":"SK DG Chomutov"},408,{"$f":"IF(E9=0,\"\",VLOOKUP($E9,seznam!$A$2:$F$5009,4,FALSE))","v":3},{"$f":"IF(E9=0,\"\",VLOOKUP($E9,seznam!$A$2:$F$5009,5,FALSE))","v":"S"},26,24,28,24,null,null,null,null,102,25.5,4,2,4,{"$f":"IF(E9=0,\"\",IF(ROUND('typ turnaje'!$G$24+(+$V$3-$Q9)/'typ turnaje'!$H$24,0)>0,ROUND('typ turnaje'!$G$24+(+$V$3-$Q9)/'typ turnaje'!$H$24,0),0))","v":60}]
[9,35,{"$f":"IF(E10=0,\"\",VLOOKUP($E10,seznam!$A$2:$F$5009,2,FALSE))","v":"Vitner Václav"},{"$f":"IF(E10=0,\"\",VLOOKUP($E10,seznam!$A$2:$F$5009,3,FALSE))","v":"GC 85 Rakovník"},1134,{"$f":"IF(E10=0,\"\",VLOOKUP($E10,seznam!$A$2:$F$5009,4,FALSE))","v":2},{"$f":"IF(E10=0,\"\",VLOOKUP($E10,seznam!$A$2:$F$5009,5,FALSE))","v":"S"},29,24,24,26,null,null,null,null,103,25.75,5,2,4,{"$f":"IF(E10=0,\"\",IF(ROUND('typ turnaje'!$G$24+(+$V$3-$Q10)/'typ turnaje'!$H$24,0)>0,ROUND('typ turnaje'!$G$24+(+$V$3-$Q10)/'typ turnaje'!$H$24,0),0))","v":59}]
[10,18,{"$f":"IF(E11=0,\"\",VLOOKUP($E11,seznam!$A$2:$F$5009,2,FALSE))","v":"Mandák Josef"},{"$f":"IF(E11=0,\"\",VLOOKUP($E11,seznam!$A$2:$F$5009,3,FALSE))","v":"SK DG Chomutov"},809,{"$f":"IF(E11=0,\"\",VLOOKUP($E11,seznam!$A$2:$F$5009,4,FALSE))","v":2},{"$f":"IF(E11=0,\"\",VLOOKUP($E11,seznam!$A$2:$F$5009,5,FALSE))","v":"S"},24,28,26,26,null,null,null,null,104,26,4,0,4,{"$f":"IF(E11=0,\"\",IF(ROUND('typ turnaje'!$G$24+(+$V$3-$Q11)/'typ turnaje'!$H$24,0)>0,ROUND('typ turnaje'!$G$24+(+$V$3-$Q11)/'typ turnaje'!$H$24,0),0))","v":58}]
[11,19,{"$f":"IF(E12=0,\"\",VLOOKUP($E12,seznam!$A$2:$F$5009,2,FALSE))","v":"Benda Lumír"},{"$f":"IF(E12=0,\"\",VLOOKUP($E12,seznam!$A$2:$F$5009,3,FALSE))","v":"MGC Plzeň"},746,{"$f":"IF(E12=0,\"\",VLOOKUP($E12,seznam!$A$2:$F$5009,4,FALSE))","v":1},{"$f":"IF(E12=0,\"\",VLOOKUP($E12,seznam!$A$2:$F$5009,5,FALSE))","v":"S"},27,22,28,28,null,null,null,null,105,26.25,6,1,4,{"$f":"IF(E12=0,\"\",IF(ROUND('typ turnaje'!$G$24+(+$V$3-$Q12)/'typ turnaje'!$H$24,0)>0,ROUND('typ turnaje'!$G$24+(+$V$3-$Q12)/'typ turnaje'!$H$24,0),0))","v":57}]
[12,7,{"$f":"IF(E13=0,\"\",VLOOKUP($E13,seznam!$A$2:$F$5009,2,FALSE))","v":"Dočkalová Dana"},{"$f":"IF(E13=0,\"\",VLOOKUP($E13,seznam!$A$2:$F$5009,3,FALSE))","v":"SKGC Frant. Lázně"},1388,{"$f":"IF(E13=0,\"\",VLOOKUP($E13,seznam!$A$2:$F$5009,4,FALSE))","v":"M"},{"$f":"IF(E13=0,\"\",VLOOKUP($E13,seznam!$A$2:$F$5009,5,FALSE))","v":"Se"},27,27,26,26,null,null,null,null,106,26.5,1,1,4,{"$f":"IF(E13=0,\"\",IF(ROUND('typ turnaje'!$G$24+(+$V$3-$Q13)/'typ turnaje'!$H$24,0)>0,ROUND('typ turnaje'!$G$24+(+$V$3-$Q13)/'typ turnaje'!$H$24,0),0))","v":56}]
[13,17,{"$f":"IF(E14=0,\"\",VLOOKUP($E14,seznam!$A$2:$F$5009,2,FALSE))","v":"Bireš Jan"},{"$f":"IF(E14=0,\"\",VLOOKUP($E14,seznam!$A$2:$F$5009,3,FALSE))","v":"SKGC Frant. Lázně"},652,{"$f":"IF(E14=0,\"\",VLOOKUP($E14,seznam!$A$2:$F$5009,4,FALSE))","v":"M"},{"$f":"IF(E14=0,\"\",VLOOKUP($E14,seznam!$A$2:$F$5009,5,FALSE))","v":"S2"},28,27,24,27,null,null,null,null,106,26.5,4,0,4,{"$f":"IF(E14=0,\"\",IF(ROUND('typ turnaje'!$G$24+(+$V$3-$Q14)/'typ turnaje'!$H$24,0)>0,ROUND('typ turnaje'!$G$24+(+$V$3-$Q14)/'typ turnaje'!$H$24,0),0))","v":56}]
[14,22,{"$f":"IF(E15=0,\"\",VLOOKUP($E15,seznam!$A$2:$F$5009,2,FALSE))","v":"Fiedlerová Jaroslava"},{"$f":"IF(E15=0,\"\",VLOOKUP($E15,seznam!$A$2:$F$5009,3,FALSE))","v":"SKGC Frant. Lázně"},1478,{"$f":"IF(E15=0,\"\",VLOOKUP($E15,seznam!$A$2:$F$5009,4,FALSE))","v":"M"},{"$f":"IF(E15=0,\"\",VLOOKUP($E15,seznam!$A$2:$F$5009,5,FALSE))","v":"Se"},29,26,25,27,null,null,null,null,107,26.75,4,1,4,{"$f":"IF(E15=0,\"\",IF(ROUND('typ turnaje'!$G$24+(+$V$3-$Q15)/'typ turnaje'!$H$24,0)>0,ROUND('typ turnaje'!$G$24+(+$V$3-$Q15)/'typ turnaje'!$H$24,0),0))","v":55}]
[15,16,{"$f":"IF(E16=0,\"\",VLOOKUP($E16,seznam!$A$2:$F$5009,2,FALSE))","v":"Lisa Miroslav st."},{"$f":"IF(E16=0,\"\",VLOOKUP($E16,seznam!$A$2:$F$5009,3,FALSE))","v":"SKDG Jesenice"},433,{"$f":"IF(E16=0,\"\",VLOOKUP($E16,seznam!$A$2:$F$5009,4,FALSE))","v":1},{"$f":"IF(E16=0,\"\",VLOOKUP($E16,seznam!$A$2:$F$5009,5,FALSE))","v":"S2"},27,28,27,26,null,null,null,null,108,27,2,0,4,{"$f":"IF(E16=0,\"\",IF(ROUND('typ turnaje'!$G$24+(+$V$3-$Q16)/'typ turnaje'!$H$24,0)>0,ROUND('typ turnaje'!$G$24+(+$V$3-$Q16)/'typ turnaje'!$H$24,0),0))","v":54}]
[16,5,{"$f":"IF(E17=0,\"\",VLOOKUP($E17,seznam!$A$2:$F$5009,2,FALSE))","v":"Horáček Vlastislav"},{"$f":"IF(E17=0,\"\",VLOOKUP($E17,seznam!$A$2:$F$5009,3,FALSE))","v":"SKGC Frant. Lázně"},233,{"$f":"IF(E17=0,\"\",VLOOKUP($E17,seznam!$A$2:$F$5009,4,FALSE))","v":4},{"$f":"IF(E17=0,\"\",VLOOKUP($E17,seznam!$A$2:$F$5009,5,FALSE))","v":"S"},27,28,26,27,null,null,null,null,108,27,2,0,4,{"$f":"IF(E17=0,\"\",IF(ROUND('typ turnaje'!$G$24+(+$V$3-$Q17)/'typ turnaje'!$H$24,0)>0,ROUND('typ turnaje'!$G$24+(+$V$3-$Q17)/'typ turnaje'!$H$24,0),0))","v":54}]
[17,42,{"$f":"IF(E18=0,\"\",VLOOKUP($E18,seznam!$A$2:$F$5009,2,FALSE))","v":"Vosmíková Petra"},{"$f":"IF(E18=0,\"\",VLOOKUP($E18,seznam!$A$2:$F$5009,3,FALSE))","v":"GC 85 Rakovník"},986,{"$f":"IF(E18=0,\"\",VLOOKUP($E18,seznam!$A$2:$F$5009,4,FALSE))","v":1},{"$f":"IF(E18=0,\"\",VLOOKUP($E18,seznam!$A$2:$F$5009,5,FALSE))","v":"Z"},27,28,29,25,null,null,null,null,109,27.25,4,1,4,{"$f":"IF(E18=0,\"\",IF(ROUND('typ turnaje'!$G$24+(+$V$3-$Q18)/'typ turnaje'!$H$24,0)>0,ROUND('typ turnaje'!$G$24+(+$V$3-$Q18)/'typ turnaje'!$H$24,0),0))","v":53}]
[18,8,{"$f":"IF(E19=0,\"\",VLOOKUP($E19,seznam!$A$2:$F$5009,2,FALSE))","v":"Drozda Zdeněk"},{"$f":"IF(E19=0,\"\",VLOOKUP($E19,seznam!$A$2:$F$5009,3,FALSE))","v":"SK DG Chomutov"},1324,{"$f":"IF(E19=0,\"\",VLOOKUP($E19,seznam!$A$2:$F$5009,4,FALSE))","v":3},{"$f":"IF(E19=0,\"\",VLOOKUP($E19,seznam!$A$2:$F$5009,5,FALSE))","v":"M"},25,26,30,28,null,null,null,null,109,27.25,5,2,4,{"$f":"IF(E19=0,\"\",IF(ROUND('typ turnaje'!$G$24+(+$V$3-$Q19)/'typ turnaje'!$H$24,0)>0,ROUND('typ turnaje'!$G$24+(+$V$3-$Q19)/'typ turnaje'!$H$24,0),0))","v":53}]
[19,11,{"$f":"IF(E20=0,\"\",VLOOKUP($E20,seznam!$A$2:$F$5009,2,FALSE))","v":"Brettlová Jana"},{"$f":"IF(E20=0,\"\",VLOOKUP($E20,seznam!$A$2:$F$5009,3,FALSE))","v":"SKDG Jesenice"},2570,{"$f":"IF(E20=0,\"\",VLOOKUP($E20,seznam!$A$2:$F$5009,4,FALSE))","v":2},{"$f":"IF(E20=0,\"\",VLOOKUP($E20,seznam!$A$2:$F$5009,5,FALSE))","v":"Z"},30,26,29,26,null,null,null,null,111,27.75,4,3,4,{"$f":"IF(E20=0,\"\",IF(ROUND('typ turnaje'!$G$24+(+$V$3-$Q20)/'typ turnaje'!$H$24,0)>0,ROUND('typ turnaje'!$G$24+(+$V$3-$Q20)/'typ turnaje'!$H$24,0),0))","v":51}]
[20,10,{"$f":"IF(E21=0,\"\",VLOOKUP($E21,seznam!$A$2:$F$5009,2,FALSE))","v":"Beran Robert"},{"$f":"IF(E21=0,\"\",VLOOKUP($E21,seznam!$A$2:$F$5009,3,FALSE))","v":"SKGC Frant. Lázně"},1150,{"$f":"IF(E21=0,\"\",VLOOKUP($E21,seznam!$A$2:$F$5009,4,FALSE))","v":3},{"$f":"IF(E21=0,\"\",VLOOKUP($E21,seznam!$A$2:$F$5009,5,FALSE))","v":"S"},31,31,24,26,null,null,null,null,112,28,7,5,4,{"$f":"IF(E21=0,\"\",IF(ROUND('typ turnaje'!$G$24+(+$V$3-$Q21)/'typ turnaje'!$H$24,0)>0,ROUND('typ turnaje'!$G$24+(+$V$3-$Q21)/'typ turnaje'!$H$24,0),0))","v":50}]
[21,13,{"$f":"IF(E22=0,\"\",VLOOKUP($E22,seznam!$A$2:$F$5009,2,FALSE))","v":"Pajkov Mitko"},{"$f":"IF(E22=0,\"\",VLOOKUP($E22,seznam!$A$2:$F$5009,3,FALSE))","v":"SK DG Chomutov"},2318,{"$f":"IF(E22=0,\"\",VLOOKUP($E22,seznam!$A$2:$F$5009,4,FALSE))","v":3},{"$f":"IF(E22=0,\"\",VLOOKUP($E22,seznam!$A$2:$F$5009,5,FALSE))","v":"M"},30,26,27,32,null,null,null,null,115,28.75,6,3,4,{"$f":"IF(E22=0,\"\",IF(ROUND('typ turnaje'!$G$24+(+$V$3-$Q22)/'typ turnaje'!$H$24,0)>0,ROUND('typ turnaje'!$G$24+(+$V$3-$Q22)/'typ turnaje'!$H$24,0),0))","v":47}]
[22,25,{"$f":"IF(E23=0,\"\",VLOOKUP($E23,seznam!$A$2:$F$5009,2,FALSE))","v":"Wolf Jan"},{"$f":"IF(E23=0,\"\",VLOOKUP($E23,seznam!$A$2:$F$5009,3,FALSE))","v":"TJ MG Cheb"},3051,{"$f":"IF(E23=0,\"\",VLOOKUP($E23,seznam!$A$2:$F$5009,4,FALSE))","v":1},{"$f":"IF(E23=0,\"\",VLOOKUP($E23,seznam!$A$2:$F$5009,5,FALSE))","v":"M"},32,30,28,26,null,null,null,null,116,29,6,2,4,{"$f":"IF(E23=0,\"\",IF(ROUND('typ turnaje'!$G$24+(+$V$3-$Q23)/'typ turnaje'!$H$24,0)>0,ROUND('typ turnaje'!$G$24+(+$V$3-$Q23)/'typ turnaje'!$H$24,0),0))","v":46}]
[23,41,{"$f":"IF(E24=0,\"\",VLOOKUP($E24,seznam!$A$2:$F$5009,2,FALSE))","v":"Mansfeld Martin"},{"$f":"IF(E24=0,\"\",VLOOKUP($E24,seznam!$A$2:$F$5009,3,FALSE))","v":"TJ MG Cheb"},2403,{"$f":"IF(E24=0,\"\",VLOOKUP($E24,seznam!$A$2:$F$5009,4,FALSE))","v":4},{"$f":"IF(E24=0,\"\",VLOOKUP($E24,seznam!$A$2:$F$5009,5,FALSE))","v":"M"},31,34,27,24,null,null,null,null,116,29,10,4,4,{"$f":"IF(E24=0,\"\",IF(ROUND('typ turnaje'!$G$24+(+$V$3-$Q24)/'typ turnaje'!$H$24,0)>0,ROUND('typ turnaje'!$G$24+(+$V$3-$Q24)/'typ turnaje'!$H$24,0),0))","v":46}]
[24,40,{"$f":"IF(E25=0,\"\",VLOOKUP($E25,seznam!$A$2:$F$5009,2,FALSE))","v":"Luxa Radek"},{"$f":"IF(E25=0,\"\",VLOOKUP($E25,seznam!$A$2:$F$5009,3,FALSE))","v":"GC 85 Rakovník"},3066,{"$f":"IF(E25=0,\"\",VLOOKUP($E25,seznam!$A$2:$F$5009,4,FALSE))","v":2},{"$f":"IF(E25=0,\"\",VLOOKUP($E25,seznam!$A$2:$F$5009,5,FALSE))","v":"M"},31,29,29,28,null,null,null,null,117,29.25,3,0,4,{"$f":"IF(E25=0,\"\",IF(ROUND('typ turnaje'!$G$24+(+$V$3-$Q25)/'typ turnaje'!$H$24,0)>0,ROUND('typ turnaje'!$G$24+(+$V$3-$Q25)/'typ turnaje'!$H$24,0),0))","v":45}]
[25,9,{"$f":"IF(E26=0,\"\",VLOOKUP($E26,seznam!$A$2:$F$5009,2,FALSE))","v":"Moutvička Jaroslav"},{"$f":"IF(E26=0,\"\",VLOOKUP($E26,seznam!$A$2:$F$5009,3,FALSE))","v":"MGC Plzeň"},2502,{"$f":"IF(E26=0,\"\",VLOOKUP($E26,seznam!$A$2:$F$5009,4,FALSE))","v":2},{"$f":"IF(E26=0,\"\",VLOOKUP($E26,seznam!$A$2:$F$5009,5,FALSE))","v":"S"},28,32,30,27,null,null,null,null,117,29.25,5,2,4,{"$f":"IF(E26=0,\"\",IF(ROUND('typ turnaje'!$G$24+(+$V$3-$Q26)/'typ turnaje'!$H$24,0)>0,ROUND('typ turnaje'!$G$24+(+$V$3-$Q26)/'typ turnaje'!$H$24,0),0))","v":45}]
[{"$f":"IF(E27=0,\"\",A26+1)","v":26},38,{"$f":"IF(E27=0,\"\",VLOOKUP($E27,seznam!$A$2:$F$5009,2,FALSE))","v":"Kropáček Václav"},{"$f":"IF(E27=0,\"\",VLOOKUP($E27,seznam!$A$2:$F$5009,3,FALSE))","v":"GC 85 Rakovník"},202,{"$f":"IF(E27=0,\"\",VLOOKUP($E27,seznam!$A$2:$F$5009,4,FALSE))","v":2},{"$f":"IF(E27=0,\"\",VLOOKUP($E27,seznam!$A$2:$F$5009,5,FALSE))","v":"S"},28,30,28,33,null,null,null,null,119,29.75,5,2,4,{"$f":"IF(E27=0,\"\",IF(ROUND('typ turnaje'!$G$24+(+$V$3-$Q27)/'typ turnaje'!$H$24,0)>0,ROUND('typ turnaje'!$G$24+(+$V$3-$Q27)/'typ turnaje'!$H$24,0),0))","v":43}]
[27,1,{"$f":"IF(E28=0,\"\",VLOOKUP($E28,seznam!$A$2:$F$5009,2,FALSE))","v":"Gruncl Josef"},{"$f":"IF(E28=0,\"\",VLOOKUP($E28,seznam!$A$2:$F$5009,3,FALSE))","v":"SKDG Jesenice"},1278,{"$f":"IF(E28=0,\"\",VLOOKUP($E28,seznam!$A$2:$F$5009,4,FALSE))","v":3},{"$f":"IF(E28=0,\"\",VLOOKUP($E28,seznam!$A$2:$F$5009,5,FALSE))","v":"S"},29,30,32,31,null,null,null,null,122,30.5,3,1,4,{"$f":"IF(E28=0,\"\",IF(ROUND('typ turnaje'!$G$24+(+$V$3-$Q28)/'typ turnaje'!$H$24,0)>0,ROUND('typ turnaje'!$G$24+(+$V$3-$Q28)/'typ turnaje'!$H$24,0),0))","v":40}]
[28,30,{"$f":"IF(E29=0,\"\",VLOOKUP($E29,seznam!$A$2:$F$5009,2,FALSE))","v":"Fiedler Vladimír"},{"$f":"IF(E29=0,\"\",VLOOKUP($E29,seznam!$A$2:$F$5009,3,FALSE))","v":"SKGC Frant. Lázně"},1416,{"$f":"IF(E29=0,\"\",VLOOKUP($E29,seznam!$A$2:$F$5009,4,FALSE))","v":2},{"$f":"IF(E29=0,\"\",VLOOKUP($E29,seznam!$A$2:$F$5009,5,FALSE))","v":"M"},31,29,33,31,null,null,null,null,124,31,4,0,4,{"$f":"IF(E29=0,\"\",IF(ROUND('typ turnaje'!$G$24+(+$V$3-$Q29)/'typ turnaje'!$H$24,0)>0,ROUND('typ turnaje'!$G$24+(+$V$3-$Q29)/'typ turnaje'!$H$24,0),0))","v":38}]
[29,6,{"$f":"IF(E30=0,\"\",VLOOKUP($E30,seznam!$A$2:$F$5009,2,FALSE))","v":"Wenzl Daniel"},{"$f":"IF(E30=0,\"\",VLOOKUP($E30,seznam!$A$2:$F$5009,3,FALSE))","v":"SKDG Jesenice"},712,{"$f":"IF(E30=0,\"\",VLOOKUP($E30,seznam!$A$2:$F$5009,4,FALSE))","v":3},{"$f":"IF(E30=0,\"\",VLOOKUP($E30,seznam!$A$2:$F$5009,5,FALSE))","v":"S"},28,33,34,29,null,null,null,null,124,31,6,4,4,{"$f":"IF(E30=0,\"\",IF(ROUND('typ turnaje'!$G$24+(+$V$3-$Q30)/'typ turnaje'!$H$24,0)>0,ROUND('typ turnaje'!$G$24+(+$V$3-$Q30)/'typ turnaje'!$H$24,0),0))","v":38}]
[30,36,{"$f":"IF(E31=0,\"\",VLOOKUP($E31,seznam!$A$2:$F$5009,2,FALSE))","v":"Kadlecová Eva"},{"$f":"IF(E31=0,\"\",VLOOKUP($E31,seznam!$A$2:$F$5009,3,FALSE))","v":"TJ MG Cheb"},3535,{"$f":"IF(E31=0,\"\",VLOOKUP($E31,seznam!$A$2:$F$5009,4,FALSE))","v":4},{"$f":"IF(E31=0,\"\",VLOOKUP($E31,seznam!$A$2:$F$5009,5,FALSE))","v":"Z"},33,29,32,31,null,null,null,null,125,31.25,4,1,4,{"$f":"IF(E31=0,\"\",IF(ROUND('typ turnaje'!$G$24+(+$V$3-$Q31)/'typ turnaje'!$H$24,0)>0,ROUND('typ turnaje'!$G$24+(+$V$3-$Q31)/'typ turnaje'!$H$24,0),0))","v":37}]
[31,28,{"$f":"IF(E32=0,\"\",VLOOKUP($E32,seznam!$A$2:$F$5009,2,FALSE))","v":"Kocum Ondřej"},{"$f":"IF(E32=0,\"\",VLOOKUP($E32,seznam!$A$2:$F$5009,3,FALSE))","v":"TJ MG Cheb"},3552,{"$f":"IF(E32=0,\"\",VLOOKUP($E32,seznam!$A$2:$F$5009,4,FALSE))","v":3},{"$f":"IF(E32=0,\"\",VLOOKUP($E32,seznam!$A$2:$F$5009,5,FALSE))","v":"M"},28,26,37,34,null,null,null,null,125,31.25,11,6,4,{"$f":"IF(E32=0,\"\",IF(ROUND('typ turnaje'!$G$24+(+$V$3-$Q32)/'typ turnaje'!$H$24,0)>0,ROUND('typ turnaje'!$G$24+(+$V$3-$Q32)/'typ turnaje'!$H$24,0),0))","v":37}]
[32,24,{"$f":"IF(E33=0,\"\",VLOOKUP($E33,seznam!$A$2:$F$5009,2,FALSE))","v":"Birešová Vlasta"},{"$f":"IF(E33=0,\"\",VLOOKUP($E33,seznam!$A$2:$F$5009,3,FALSE))","v":"SKGC Frant. Lázně"},526,{"$f":"IF(E33=0,\"\",VLOOKUP($E33,seznam!$A$2:$F$5009,4,FALSE))","v":2},{"$f":"IF(E33=0,\"\",VLOOKUP($E33,seznam!$A$2:$F$5009,5,FALSE))","v":"Se"},31,34,31,30,null,null,null,null,126,31.5,4,0,4,{"$f":"IF(E33=0,\"\",IF(ROUND('typ turnaje'!$G$24+(+$V$3-$Q33)/'typ turnaje'!$H$24,0)>0,ROUND('typ turnaje'!$G$24+(+$V$3-$Q33)/'typ turnaje'!$H$24,0),0))","v":36}]
[33,31,{"$f":"IF(E34=0,\"\",VLOOKUP($E34,seznam!$A$2:$F$5009,2,FALSE))","v":"Bláha Milan"},{"$f":"IF(E34=0,\"\",VLOOKUP($E34,seznam!$A$2:$F$5009,3,FALSE))","v":"GC 85 Rakovník"},1099,{"$f":"IF(E34=0,\"\",VLOOKUP($E34,seznam!$A$2:$F$5009,4,FALSE))","v":2},{"$f":"IF(E34=0,\"\",VLOOKUP($E34,seznam!$A$2:$F$5009,5,FALSE))","v":"S"},33,28,28,39,null,null,null,null,{"$f":"IF(E34=0,\"\",SUM(H34:O34))","v":128},{"$f":"IF(E34=0,\"\",+P34/COUNT(H34:O34))","v":32},{"$f":"IF(E34=0,\"\",MAX($H34:$O34)-MIN($H34:$O34))","v":11},{"$f":"IF(E34=0,\"\",LARGE($H34:$O34,2)-SMALL($H34:$O34,2))","v":5},{"$f":"IF(E34=0,\"\",+COUNT(H34:O34))","v":4},{"$f":"IF(E34=0,\"\",IF(ROUND('typ turnaje'!$G$24+(+$V$3-$Q34)/'typ turnaje'!$H$24,0)>0,ROUND('typ turnaje'!$G$24+(+$V$3-$Q34)/'typ turnaje'!$H$24,0),0))","v":34}]
[{"$f":"IF(E35=0,\"\",A34+1)","v":34},39,{"$f":"IF(E35=0,\"\",VLOOKUP($E35,seznam!$A$2:$F$5009,2,FALSE))","v":"Hubinger Miroslav"},{"$f":"IF(E35=0,\"\",VLOOKUP($E35,seznam!$A$2:$F$5009,3,FALSE))","v":"MG České údolí Plzeň 3"},442,{"$f":"IF(E35=0,\"\",VLOOKUP($E35,seznam!$A$2:$F$5009,4,FALSE))","v":5},{"$f":"IF(E35=0,\"\",VLOOKUP($E35,seznam!$A$2:$F$5009,5,FALSE))","v":"S"},30,32,33,34,null,null,null,null,129,32.25,4,1,4,{"$f":"IF(E35=0,\"\",IF(ROUND('typ turnaje'!$G$24+(+$V$3-$Q35)/'typ turnaje'!$H$24,0)>0,ROUND('typ turnaje'!$G$24+(+$V$3-$Q35)/'typ turnaje'!$H$24,0),0))","v":33}]
[35,23,{"$f":"IF(E36=0,\"\",VLOOKUP($E36,seznam!$A$2:$F$5009,2,FALSE))","v":"Kubantová Lucie"},{"$f":"IF(E36=0,\"\",VLOOKUP($E36,seznam!$A$2:$F$5009,3,FALSE))","v":"SK DG Chomutov"},3011,{"$f":"IF(E36=0,\"\",VLOOKUP($E36,seznam!$A$2:$F$5009,4,FALSE))","v":5},{"$f":"IF(E36=0,\"\",VLOOKUP($E36,seznam!$A$2:$F$5009,5,FALSE))","v":"Z"},36,34,31,29,null,null,null,null,130,32.5,7,3,4,{"$f":"IF(E36=0,\"\",IF(ROUND('typ turnaje'!$G$24+(+$V$3-$Q36)/'typ turnaje'!$H$24,0)>0,ROUND('typ turnaje'!$G$24+(+$V$3-$Q36)/'typ turnaje'!$H$24,0),0))","v":32}]
[36,32,{"$f":"IF(E37=0,\"\",VLOOKUP($E37,seznam!$A$2:$F$5009,2,FALSE))","v":"Kadlec Jan"},{"$f":"IF(E37=0,\"\",VLOOKUP($E37,seznam!$A$2:$F$5009,3,FALSE))","v":"TJ MG Cheb"},3536,{"$f":"IF(E37=0,\"\",VLOOKUP($E37,seznam!$A$2:$F$5009,4,FALSE))","v":2},{"$f":"IF(E37=0,\"\",VLOOKUP($E37,seznam!$A$2:$F$5009,5,FALSE))","v":"Jz"},34,32,34,31,null,null,null,null,131,32.75,3,2,4,{"$f":"IF(E37=0,\"\",IF(ROUND('typ turnaje'!$G$24+(+$V$3-$Q37)/'typ turnaje'!$H$24,0)>0,ROUND('typ turnaje'!$G$24+(+$V$3-$Q37)/'typ turnaje'!$H$24,0),0))","v":31}]
[37,37,{"$f":"IF(E38=0,\"\",VLOOKUP($E38,seznam!$A$2:$F$5009,2,FALSE))","v":"Nečekal František st."},{"$f":"IF(E38=0,\"\",VLOOKUP($E38,seznam!$A$2:$F$5009,3,FALSE))","v":"TJ MG Cheb"},238,{"$f":"IF(E38=0,\"\",VLOOKUP($E38,seznam!$A$2:$F$5009,4,FALSE))","v":1},{"$f":"IF(E38=0,\"\",VLOOKUP($E38,seznam!$A$2:$F$5009,5,FALSE))","v":"S2"},34,28,34,38,null,null,null,null,134,33.5,10,0,4,{"$f":"IF(E38=0,\"\",IF(ROUND('typ turnaje'!$G$24+(+$V$3-$Q38)/'typ turnaje'!$H$24,0)>0,ROUND('typ turnaje'!$G$24+(+$V$3-$Q38)/'typ turnaje'!$H$24,0),0))","v":28}]
[38,33,{"$f":"IF(E39=0,\"\",VLOOKUP($E39,seznam!$A$2:$F$5009,2,FALSE))","v":"Fiedlerová Jana"},{"$f":"IF(E39=0,\"\",VLOOKUP($E39,seznam!$A$2:$F$5009,3,FALSE))","v":"SKGC Frant. Lázně"},3521,{"$f":"IF(E39=0,\"\",VLOOKUP($E39,seznam!$A$2:$F$5009,4,FALSE))","v":2},{"$f":"IF(E39=0,\"\",VLOOKUP($E39,seznam!$A$2:$F$5009,5,FALSE))","v":"Z"},31,37,33,35,null,null,null,null,136,34,6,2,4,{"$f":"IF(E39=0,\"\",IF(ROUND('typ turnaje'!$G$24+(+$V$3-$Q39)/'typ turnaje'!$H$24,0)>0,ROUND('typ turnaje'!$G$24+(+$V$3-$Q39)/'typ turnaje'!$H$24,0),0))","v":26}]
[39,34,{"$f":"IF(E40=0,\"\",VLOOKUP($E40,seznam!$A$2:$F$5009,2,FALSE))","v":"Kratochvíl Jaroslav"},{"$f":"IF(E40=0,\"\",VLOOKUP($E40,seznam!$A$2:$F$5009,3,FALSE))","v":"SKDG Jesenice"},235,{"$f":"IF(E40=0,\"\",VLOOKUP($E40,seznam!$A$2:$F$5009,4,FALSE))","v":2},{"$f":"IF(E40=0,\"\",VLOOKUP($E40,seznam!$A$2:$F$5009,5,FALSE))","v":"S2"},33,37,34,33,null,null,null,null,137,34.25,4,1,4,{"$f":"IF(E40=0,\"\",IF(ROUND('typ turnaje'!$G$24+(+$V$3-$Q40)/'typ turnaje'!$H$24,0)>0,ROUND('typ turnaje'!$G$24+(+$V$3-$Q40)/'typ turnaje'!$H$24,0),0))","v":25}]
[40,21,{"$f":"IF(E41=0,\"\",VLOOKUP($E41,seznam!$A$2:$F$5009,2,FALSE))","v":"Cimerman Jan"},{"$f":"IF(E41=0,\"\",VLOOKUP($E41,seznam!$A$2:$F$5009,3,FALSE))","v":"SKDG Jesenice"},2396,{"$f":"IF(E41=0,\"\",VLOOKUP($E41,seznam!$A$2:$F$5009,4,FALSE))","v":4},{"$f":"IF(E41=0,\"\",VLOOKUP($E41,seznam!$A$2:$F$5009,5,FALSE))","v":"M"},30,42,35,31,null,null,null,null,138,34.5,12,4,4,{"$f":"IF(E41=0,\"\",IF(ROUND('typ turnaje'!$G$24+(+$V$3-$Q41)/'typ turnaje'!$H$24,0)>0,ROUND('typ turnaje'!$G$24+(+$V$3-$Q41)/'typ turnaje'!$H$24,0),0))","v":24}]
[41,29,{"$f":"IF(E42=0,\"\",VLOOKUP($E42,seznam!$A$2:$F$5009,2,FALSE))","v":"Zachová Marcela"},{"$f":"IF(E42=0,\"\",VLOOKUP($E42,seznam!$A$2:$F$5009,3,FALSE))","v":"SK DG Chomutov"},2918,{"$f":"IF(E42=0,\"\",VLOOKUP($E42,seznam!$A$2:$F$5009,4,FALSE))","v":3},{"$f":"IF(E42=0,\"\",VLOOKUP($E42,seznam!$A$2:$F$5009,5,FALSE))","v":"Se"},43,37,28,35,null,null,null,null,143,35.75,15,2,4,{"$f":"IF(E42=0,\"\",IF(ROUND('typ turnaje'!$G$24+(+$V$3-$Q42)/'typ turnaje'!$H$24,0)>0,ROUND('typ turnaje'!$G$24+(+$V$3-$Q42)/'typ turnaje'!$H$24,0),0))","v":19}]
[42,26,{"$f":"IF(E43=0,\"\",VLOOKUP($E43,seznam!$A$2:$F$5009,2,FALSE))","v":"Cimerman Jaroslav"},{"$f":"IF(E43=0,\"\",VLOOKUP($E43,seznam!$A$2:$F$5009,3,FALSE))","v":"SKDG Jesenice"},2395,{"$f":"IF(E43=0,\"\",VLOOKUP($E43,seznam!$A$2:$F$5009,4,FALSE))","v":4},{"$f":"IF(E43=0,\"\",VLOOKUP($E43,seznam!$A$2:$F$5009,5,FALSE))","v":"S2"},39,38,32,39,null,null,null,null,148,37,7,1,4,{"$f":"IF(E43=0,\"\",IF(ROUND('typ turnaje'!$G$24+(+$V$3-$Q43)/'typ turnaje'!$H$24,0)>0,ROUND('typ turnaje'!$G$24+(+$V$3-$Q43)/'typ turnaje'!$H$24,0),0))","v":14}]
["",43,{"$f":"IF(E44=0,\"\",VLOOKUP($E44,seznam!$A$2:$F$5009,2,FALSE))","v":""},{"$f":"IF(E44=0,\"\",VLOOKUP($E44,seznam!$A$2:$F$5009,3,FALSE))","v":""},null,{"$f":"IF(E44=0,\"\",VLOOKUP($E44,seznam!$A$2:$F$5009,4,FALSE))","v":""},{"$f":"IF(E44=0,\"\",VLOOKUP($E44,seznam!$A$2:$F$5009,5,FALSE))","v":""},null,null,null,null,null,null,null,null,"","","","","",{"$f":"IF(E44=0,\"\",IF(ROUND('typ turnaje'!$G$24+(+$V$3-$Q44)/'typ turnaje'!$H$24,0)>0,ROUND('typ turnaje'!$G$24+(+$V$3-$Q44)/'typ turnaje'!$H$24,0),0))","v":""}]
["",44,{"$f":"IF(E45=0,\"\",VLOOKUP($E45,seznam!$A$2:$F$5009,2,FALSE))","v":""},{"$f":"IF(E45=0,\"\",VLOOKUP($E45,seznam!$A$2:$F$5009,3,FALSE))","v":""},null,{"$f":"IF(E45=0,\"\",VLOOKUP($E45,seznam!$A$2:$F$5009,4,FALSE))","v":""},{"$f":"IF(E45=0,\"\",VLOOKUP($E45,seznam!$A$2:$F$5009,5,FALSE))","v":""},null,null,null,null,null,null,null,null,"","","","","",{"$f":"IF(E45=0,\"\",IF(ROUND('typ turnaje'!$G$24+(+$V$3-$Q45)/'typ turnaje'!$H$24,0)>0,ROUND('typ turnaje'!$G$24+(+$V$3-$Q45)/'typ turnaje'!$H$24,0),0))","v":""}]
["",45,{"$f":"IF(E46=0,\"\",VLOOKUP($E46,seznam!$A$2:$F$5009,2,FALSE))","v":""},{"$f":"IF(E46=0,\"\",VLOOKUP($E46,seznam!$A$2:$F$5009,3,FALSE))","v":""},null,{"$f":"IF(E46=0,\"\",VLOOKUP($E46,seznam!$A$2:$F$5009,4,FALSE))","v":""},{"$f":"IF(E46=0,\"\",VLOOKUP($E46,seznam!$A$2:$F$5009,5,FALSE))","v":""},null,null,null,null,null,null,null,null,"","","","","",{"$f":"IF(E46=0,\"\",IF(ROUND('typ turnaje'!$G$24+(+$V$3-$Q46)/'typ turnaje'!$H$24,0)>0,ROUND('typ turnaje'!$G$24+(+$V$3-$Q46)/'typ turnaje'!$H$24,0),0))","v":""}]
["",46,{"$f":"IF(E47=0,\"\",VLOOKUP($E47,seznam!$A$2:$F$5009,2,FALSE))","v":""},{"$f":"IF(E47=0,\"\",VLOOKUP($E47,seznam!$A$2:$F$5009,3,FALSE))","v":""},null,{"$f":"IF(E47=0,\"\",VLOOKUP($E47,seznam!$A$2:$F$5009,4,FALSE))","v":""},{"$f":"IF(E47=0,\"\",VLOOKUP($E47,seznam!$A$2:$F$5009,5,FALSE))","v":""},null,null,null,null,null,null,null,null,"","","","","",{"$f":"IF(E47=0,\"\",IF(ROUND('typ turnaje'!$G$24+(+$V$3-$Q47)/'typ turnaje'!$H$24,0)>0,ROUND('typ turnaje'!$G$24+(+$V$3-$Q47)/'typ turnaje'!$H$24,0),0))","v":""}]
["",47,{"$f":"IF(E48=0,\"\",VLOOKUP($E48,seznam!$A$2:$F$5009,2,FALSE))","v":""},{"$f":"IF(E48=0,\"\",VLOOKUP($E48,seznam!$A$2:$F$5009,3,FALSE))","v":""},null,{"$f":"IF(E48=0,\"\",VLOOKUP($E48,seznam!$A$2:$F$5009,4,FALSE))","v":""},{"$f":"IF(E48=0,\"\",VLOOKUP($E48,seznam!$A$2:$F$5009,5,FALSE))","v":""},null,null,null,null,null,null,null,null,"","","","","",{"$f":"IF(E48=0,\"\",IF(ROUND('typ turnaje'!$G$24+(+$V$3-$Q48)/'typ turnaje'!$H$24,0)>0,ROUND('typ turnaje'!$G$24+(+$V$3-$Q48)/'typ turnaje'!$H$24,0),0))","v":""}]
["",48,{"$f":"IF(E49=0,\"\",VLOOKUP($E49,seznam!$A$2:$F$5009,2,FALSE))","v":""},{"$f":"IF(E49=0,\"\",VLOOKUP($E49,seznam!$A$2:$F$5009,3,FALSE))","v":""},null,{"$f":"IF(E49=0,\"\",VLOOKUP($E49,seznam!$A$2:$F$5009,4,FALSE))","v":""},{"$f":"IF(E49=0,\"\",VLOOKUP($E49,seznam!$A$2:$F$5009,5,FALSE))","v":""},null,null,null,null,null,null,null,null,"","","","","",{"$f":"IF(E49=0,\"\",IF(ROUND('typ turnaje'!$G$24+(+$V$3-$Q49)/'typ turnaje'!$H$24,0)>0,ROUND('typ turnaje'!$G$24+(+$V$3-$Q49)/'typ turnaje'!$H$24,0),0))","v":""}]
["",49,{"$f":"IF(E50=0,\"\",VLOOKUP($E50,seznam!$A$2:$F$5009,2,FALSE))","v":""},{"$f":"IF(E50=0,\"\",VLOOKUP($E50,seznam!$A$2:$F$5009,3,FALSE))","v":""},null,{"$f":"IF(E50=0,\"\",VLOOKUP($E50,seznam!$A$2:$F$5009,4,FALSE))","v":""},{"$f":"IF(E50=0,\"\",VLOOKUP($E50,seznam!$A$2:$F$5009,5,FALSE))","v":""},null,null,null,null,null,null,null,null,"","","","","",{"$f":"IF(E50=0,\"\",IF(ROUND('typ turnaje'!$G$24+(+$V$3-$Q50)/'typ turnaje'!$H$24,0)>0,ROUND('typ turnaje'!$G$24+(+$V$3-$Q50)/'typ turnaje'!$H$24,0),0))","v":""}]
["",50,{"$f":"IF(E51=0,\"\",VLOOKUP($E51,seznam!$A$2:$F$5009,2,FALSE))","v":""},{"$f":"IF(E51=0,\"\",VLOOKUP($E51,seznam!$A$2:$F$5009,3,FALSE))","v":""},null,{"$f":"IF(E51=0,\"\",VLOOKUP($E51,seznam!$A$2:$F$5009,4,FALSE))","v":""},{"$f":"IF(E51=0,\"\",VLOOKUP($E51,seznam!$A$2:$F$5009,5,FALSE))","v":""},null,null,null,null,null,null,null,null,"","","","","",{"$f":"IF(E51=0,\"\",IF(ROUND('typ turnaje'!$G$24+(+$V$3-$Q51)/'typ turnaje'!$H$24,0)>0,ROUND('typ turnaje'!$G$24+(+$V$3-$Q51)/'typ turnaje'!$H$24,0),0))","v":""}]
["",51,{"$f":"IF(E52=0,\"\",VLOOKUP($E52,seznam!$A$2:$F$5009,2,FALSE))","v":""},{"$f":"IF(E52=0,\"\",VLOOKUP($E52,seznam!$A$2:$F$5009,3,FALSE))","v":""},null,{"$f":"IF(E52=0,\"\",VLOOKUP($E52,seznam!$A$2:$F$5009,4,FALSE))","v":""},{"$f":"IF(E52=0,\"\",VLOOKUP($E52,seznam!$A$2:$F$5009,5,FALSE))","v":""},null,null,null,null,null,null,null,null,"","","","","",{"$f":"IF(E52=0,\"\",IF(ROUND('typ turnaje'!$G$24+(+$V$3-$Q52)/'typ turnaje'!$H$24,0)>0,ROUND('typ turnaje'!$G$24+(+$V$3-$Q52)/'typ turnaje'!$H$24,0),0))","v":""}]
["",52,{"$f":"IF(E53=0,\"\",VLOOKUP($E53,seznam!$A$2:$F$5009,2,FALSE))","v":""},{"$f":"IF(E53=0,\"\",VLOOKUP($E53,seznam!$A$2:$F$5009,3,FALSE))","v":""},null,{"$f":"IF(E53=0,\"\",VLOOKUP($E53,seznam!$A$2:$F$5009,4,FALSE))","v":""},{"$f":"IF(E53=0,\"\",VLOOKUP($E53,seznam!$A$2:$F$5009,5,FALSE))","v":""},null,null,null,null,null,null,null,null,"","","","","",{"$f":"IF(E53=0,\"\",IF(ROUND('typ turnaje'!$G$24+(+$V$3-$Q53)/'typ turnaje'!$H$24,0)>0,ROUND('typ turnaje'!$G$24+(+$V$3-$Q53)/'typ turnaje'!$H$24,0),0))","v":""}]
["",53,{"$f":"IF(E54=0,\"\",VLOOKUP($E54,seznam!$A$2:$F$5009,2,FALSE))","v":""},{"$f":"IF(E54=0,\"\",VLOOKUP($E54,seznam!$A$2:$F$5009,3,FALSE))","v":""},null,{"$f":"IF(E54=0,\"\",VLOOKUP($E54,seznam!$A$2:$F$5009,4,FALSE))","v":""},{"$f":"IF(E54=0,\"\",VLOOKUP($E54,seznam!$A$2:$F$5009,5,FALSE))","v":""},null,null,null,null,null,null,null,null,"","","","","",{"$f":"IF(E54=0,\"\",IF(ROUND('typ turnaje'!$G$24+(+$V$3-$Q54)/'typ turnaje'!$H$24,0)>0,ROUND('typ turnaje'!$G$24+(+$V$3-$Q54)/'typ turnaje'!$H$24,0),0))","v":""}]
["",54,{"$f":"IF(E55=0,\"\",VLOOKUP($E55,seznam!$A$2:$F$5009,2,FALSE))","v":""},{"$f":"IF(E55=0,\"\",VLOOKUP($E55,seznam!$A$2:$F$5009,3,FALSE))","v":""},null,{"$f":"IF(E55=0,\"\",VLOOKUP($E55,seznam!$A$2:$F$5009,4,FALSE))","v":""},{"$f":"IF(E55=0,\"\",VLOOKUP($E55,seznam!$A$2:$F$5009,5,FALSE))","v":""},null,null,null,null,null,null,null,null,"","","","","",{"$f":"IF(E55=0,\"\",IF(ROUND('typ turnaje'!$G$24+(+$V$3-$Q55)/'typ turnaje'!$H$24,0)>0,ROUND('typ turnaje'!$G$24+(+$V$3-$Q55)/'typ turnaje'!$H$24,0),0))","v":""}]
["",55,{"$f":"IF(E56=0,\"\",VLOOKUP($E56,seznam!$A$2:$F$5009,2,FALSE))","v":""},{"$f":"IF(E56=0,\"\",VLOOKUP($E56,seznam!$A$2:$F$5009,3,FALSE))","v":""},null,{"$f":"IF(E56=0,\"\",VLOOKUP($E56,seznam!$A$2:$F$5009,4,FALSE))","v":""},{"$f":"IF(E56=0,\"\",VLOOKUP($E56,seznam!$A$2:$F$5009,5,FALSE))","v":""},null,null,null,null,null,null,null,null,"","","","","",{"$f":"IF(E56=0,\"\",IF(ROUND('typ turnaje'!$G$24+(+$V$3-$Q56)/'typ turnaje'!$H$24,0)>0,ROUND('typ turnaje'!$G$24+(+$V$3-$Q56)/'typ turnaje'!$H$24,0),0))","v":""}]
["",56,{"$f":"IF(E57=0,\"\",VLOOKUP($E57,seznam!$A$2:$F$5009,2,FALSE))","v":""},{"$f":"IF(E57=0,\"\",VLOOKUP($E57,seznam!$A$2:$F$5009,3,FALSE))","v":""},null,{"$f":"IF(E57=0,\"\",VLOOKUP($E57,seznam!$A$2:$F$5009,4,FALSE))","v":""},{"$f":"IF(E57=0,\"\",VLOOKUP($E57,seznam!$A$2:$F$5009,5,FALSE))","v":""},null,null,null,null,null,null,null,null,"","","","","",{"$f":"IF(E57=0,\"\",IF(ROUND('typ turnaje'!$G$24+(+$V$3-$Q57)/'typ turnaje'!$H$24,0)>0,ROUND('typ turnaje'!$G$24+(+$V$3-$Q57)/'typ turnaje'!$H$24,0),0))","v":""}]
["",57,{"$f":"IF(E58=0,\"\",VLOOKUP($E58,seznam!$A$2:$F$5009,2,FALSE))","v":""},{"$f":"IF(E58=0,\"\",VLOOKUP($E58,seznam!$A$2:$F$5009,3,FALSE))","v":""},null,{"$f":"IF(E58=0,\"\",VLOOKUP($E58,seznam!$A$2:$F$5009,4,FALSE))","v":""},{"$f":"IF(E58=0,\"\",VLOOKUP($E58,seznam!$A$2:$F$5009,5,FALSE))","v":""},null,null,null,null,null,null,null,null,"","","","","",{"$f":"IF(E58=0,\"\",IF(ROUND('typ turnaje'!$G$24+(+$V$3-$Q58)/'typ turnaje'!$H$24,0)>0,ROUND('typ turnaje'!$G$24+(+$V$3-$Q58)/'typ turnaje'!$H$24,0),0))","v":""}]
["",58,{"$f":"IF(E59=0,\"\",VLOOKUP($E59,seznam!$A$2:$F$5009,2,FALSE))","v":""},{"$f":"IF(E59=0,\"\",VLOOKUP($E59,seznam!$A$2:$F$5009,3,FALSE))","v":""},null,{"$f":"IF(E59=0,\"\",VLOOKUP($E59,seznam!$A$2:$F$5009,4,FALSE))","v":""},{"$f":"IF(E59=0,\"\",VLOOKUP($E59,seznam!$A$2:$F$5009,5,FALSE))","v":""},null,null,null,null,null,null,null,null,"","","","","",{"$f":"IF(E59=0,\"\",IF(ROUND('typ turnaje'!$G$24+(+$V$3-$Q59)/'typ turnaje'!$H$24,0)>0,ROUND('typ turnaje'!$G$24+(+$V$3-$Q59)/'typ turnaje'!$H$24,0),0))","v":""}]
["",59,{"$f":"IF(E60=0,\"\",VLOOKUP($E60,seznam!$A$2:$F$5009,2,FALSE))","v":""},{"$f":"IF(E60=0,\"\",VLOOKUP($E60,seznam!$A$2:$F$5009,3,FALSE))","v":""},null,{"$f":"IF(E60=0,\"\",VLOOKUP($E60,seznam!$A$2:$F$5009,4,FALSE))","v":""},{"$f":"IF(E60=0,\"\",VLOOKUP($E60,seznam!$A$2:$F$5009,5,FALSE))","v":""},null,null,null,null,null,null,null,null,"","","","","",{"$f":"IF(E60=0,\"\",IF(ROUND('typ turnaje'!$G$24+(+$V$3-$Q60)/'typ turnaje'!$H$24,0)>0,ROUND('typ turnaje'!$G$24+(+$V$3-$Q60)/'typ turnaje'!$H$24,0),0))","v":""}]
["",60,{"$f":"IF(E61=0,\"\",VLOOKUP($E61,seznam!$A$2:$F$5009,2,FALSE))","v":""},{"$f":"IF(E61=0,\"\",VLOOKUP($E61,seznam!$A$2:$F$5009,3,FALSE))","v":""},null,{"$f":"IF(E61=0,\"\",VLOOKUP($E61,seznam!$A$2:$F$5009,4,FALSE))","v":""},{"$f":"IF(E61=0,\"\",VLOOKUP($E61,seznam!$A$2:$F$5009,5,FALSE))","v":""},null,null,null,null,null,null,null,null,"","","","","",{"$f":"IF(E61=0,\"\",IF(ROUND('typ turnaje'!$G$24+(+$V$3-$Q61)/'typ turnaje'!$H$24,0)>0,ROUND('typ turnaje'!$G$24+(+$V$3-$Q61)/'typ turnaje'!$H$24,0),0))","v":""}]
["",61,{"$f":"IF(E62=0,\"\",VLOOKUP($E62,seznam!$A$2:$F$5009,2,FALSE))","v":""},{"$f":"IF(E62=0,\"\",VLOOKUP($E62,seznam!$A$2:$F$5009,3,FALSE))","v":""},null,{"$f":"IF(E62=0,\"\",VLOOKUP($E62,seznam!$A$2:$F$5009,4,FALSE))","v":""},{"$f":"IF(E62=0,\"\",VLOOKUP($E62,seznam!$A$2:$F$5009,5,FALSE))","v":""},null,null,null,null,null,null,null,null,"","","","","",{"$f":"IF(E62=0,\"\",IF(ROUND('typ turnaje'!$G$24+(+$V$3-$Q62)/'typ turnaje'!$H$24,0)>0,ROUND('typ turnaje'!$G$24+(+$V$3-$Q62)/'typ turnaje'!$H$24,0),0))","v":""}]
["",62,{"$f":"IF(E63=0,\"\",VLOOKUP($E63,seznam!$A$2:$F$5009,2,FALSE))","v":""},{"$f":"IF(E63=0,\"\",VLOOKUP($E63,seznam!$A$2:$F$5009,3,FALSE))","v":""},null,{"$f":"IF(E63=0,\"\",VLOOKUP($E63,seznam!$A$2:$F$5009,4,FALSE))","v":""},{"$f":"IF(E63=0,\"\",VLOOKUP($E63,seznam!$A$2:$F$5009,5,FALSE))","v":""},null,null,null,null,null,null,null,null,"","","","","",{"$f":"IF(E63=0,\"\",IF(ROUND('typ turnaje'!$G$24+(+$V$3-$Q63)/'typ turnaje'!$H$24,0)>0,ROUND('typ turnaje'!$G$24+(+$V$3-$Q63)/'typ turnaje'!$H$24,0),0))","v":""}]
["",63,{"$f":"IF(E64=0,\"\",VLOOKUP($E64,seznam!$A$2:$F$5009,2,FALSE))","v":""},{"$f":"IF(E64=0,\"\",VLOOKUP($E64,seznam!$A$2:$F$5009,3,FALSE))","v":""},null,{"$f":"IF(E64=0,\"\",VLOOKUP($E64,seznam!$A$2:$F$5009,4,FALSE))","v":""},{"$f":"IF(E64=0,\"\",VLOOKUP($E64,seznam!$A$2:$F$5009,5,FALSE))","v":""},null,null,null,null,null,null,null,null,"","","","","",{"$f":"IF(E64=0,\"\",IF(ROUND('typ turnaje'!$G$24+(+$V$3-$Q64)/'typ turnaje'!$H$24,0)>0,ROUND('typ turnaje'!$G$24+(+$V$3-$Q64)/'typ turnaje'!$H$24,0),0))","v":""}]
["",64,{"$f":"IF(E65=0,\"\",VLOOKUP($E65,seznam!$A$2:$F$5009,2,FALSE))","v":""},{"$f":"IF(E65=0,\"\",VLOOKUP($E65,seznam!$A$2:$F$5009,3,FALSE))","v":""},null,{"$f":"IF(E65=0,\"\",VLOOKUP($E65,seznam!$A$2:$F$5009,4,FALSE))","v":""},{"$f":"IF(E65=0,\"\",VLOOKUP($E65,seznam!$A$2:$F$5009,5,FALSE))","v":""},null,null,null,null,null,null,null,null,"","","","","",{"$f":"IF(E65=0,\"\",IF(ROUND('typ turnaje'!$G$24+(+$V$3-$Q65)/'typ turnaje'!$H$24,0)>0,ROUND('typ turnaje'!$G$24+(+$V$3-$Q65)/'typ turnaje'!$H$24,0),0))","v":""}]
["",65,{"$f":"IF(E66=0,\"\",VLOOKUP($E66,seznam!$A$2:$F$5009,2,FALSE))","v":""},{"$f":"IF(E66=0,\"\",VLOOKUP($E66,seznam!$A$2:$F$5009,3,FALSE))","v":""},null,{"$f":"IF(E66=0,\"\",VLOOKUP($E66,seznam!$A$2:$F$5009,4,FALSE))","v":""},{"$f":"IF(E66=0,\"\",VLOOKUP($E66,seznam!$A$2:$F$5009,5,FALSE))","v":""},null,null,null,null,null,null,null,null,{"$f":"IF(E66=0,\"\",SUM(H66:O66))","v":""},{"$f":"IF(E66=0,\"\",+P66/COUNT(H66:O66))","v":""},{"$f":"IF(E66=0,\"\",MAX($H66:$O66)-MIN($H66:$O66))","v":""},{"$f":"IF(E66=0,\"\",LARGE($H66:$O66,2)-SMALL($H66:$O66,2))","v":""},{"$f":"IF(E66=0,\"\",+COUNT(H66:O66))","v":""},{"$f":"IF(E66=0,\"\",IF(ROUND('typ turnaje'!$G$24+(+$V$3-$Q66)/'typ turnaje'!$H$24,0)>0,ROUND('typ turnaje'!$G$24+(+$V$3-$Q66)/'typ turnaje'!$H$24,0),0))","v":""}]
[{"$f":"IF(E67=0,\"\",A66+1)","v":""},66,{"$f":"IF(E67=0,\"\",VLOOKUP($E67,seznam!$A$2:$F$5009,2,FALSE))","v":""},{"$f":"IF(E67=0,\"\",VLOOKUP($E67,seznam!$A$2:$F$5009,3,FALSE))","v":""},null,{"$f":"IF(E67=0,\"\",VLOOKUP($E67,seznam!$A$2:$F$5009,4,FALSE))","v":""},{"$f":"IF(E67=0,\"\",VLOOKUP($E67,seznam!$A$2:$F$5009,5,FALSE))","v":""},null,null,null,null,null,null,null,null,"","","","","",{"$f":"IF(E67=0,\"\",IF(ROUND('typ turnaje'!$G$24+(+$V$3-$Q67)/'typ turnaje'!$H$24,0)>0,ROUND('typ turnaje'!$G$24+(+$V$3-$Q67)/'typ turnaje'!$H$24,0),0))","v":""}]
["",67,{"$f":"IF(E68=0,\"\",VLOOKUP($E68,seznam!$A$2:$F$5009,2,FALSE))","v":""},{"$f":"IF(E68=0,\"\",VLOOKUP($E68,seznam!$A$2:$F$5009,3,FALSE))","v":""},null,{"$f":"IF(E68=0,\"\",VLOOKUP($E68,seznam!$A$2:$F$5009,4,FALSE))","v":""},{"$f":"IF(E68=0,\"\",VLOOKUP($E68,seznam!$A$2:$F$5009,5,FALSE))","v":""},null,null,null,null,null,null,null,null,"","","","","",{"$f":"IF(E68=0,\"\",IF(ROUND('typ turnaje'!$G$24+(+$V$3-$Q68)/'typ turnaje'!$H$24,0)>0,ROUND('typ turnaje'!$G$24+(+$V$3-$Q68)/'typ turnaje'!$H$24,0),0))","v":""}]
["",68,{"$f":"IF(E69=0,\"\",VLOOKUP($E69,seznam!$A$2:$F$5009,2,FALSE))","v":""},{"$f":"IF(E69=0,\"\",VLOOKUP($E69,seznam!$A$2:$F$5009,3,FALSE))","v":""},null,{"$f":"IF(E69=0,\"\",VLOOKUP($E69,seznam!$A$2:$F$5009,4,FALSE))","v":""},{"$f":"IF(E69=0,\"\",VLOOKUP($E69,seznam!$A$2:$F$5009,5,FALSE))","v":""},null,null,null,null,null,null,null,null,"","","","","",{"$f":"IF(E69=0,\"\",IF(ROUND('typ turnaje'!$G$24+(+$V$3-$Q69)/'typ turnaje'!$H$24,0)>0,ROUND('typ turnaje'!$G$24+(+$V$3-$Q69)/'typ turnaje'!$H$24,0),0))","v":""}]
["",69,{"$f":"IF(E70=0,\"\",VLOOKUP($E70,seznam!$A$2:$F$5009,2,FALSE))","v":""},{"$f":"IF(E70=0,\"\",VLOOKUP($E70,seznam!$A$2:$F$5009,3,FALSE))","v":""},null,{"$f":"IF(E70=0,\"\",VLOOKUP($E70,seznam!$A$2:$F$5009,4,FALSE))","v":""},{"$f":"IF(E70=0,\"\",VLOOKUP($E70,seznam!$A$2:$F$5009,5,FALSE))","v":""},null,null,null,null,null,null,null,null,"","","","","",{"$f":"IF(E70=0,\"\",IF(ROUND('typ turnaje'!$G$24+(+$V$3-$Q70)/'typ turnaje'!$H$24,0)>0,ROUND('typ turnaje'!$G$24+(+$V$3-$Q70)/'typ turnaje'!$H$24,0),0))","v":""}]
["",70,{"$f":"IF(E71=0,\"\",VLOOKUP($E71,seznam!$A$2:$F$5009,2,FALSE))","v":""},{"$f":"IF(E71=0,\"\",VLOOKUP($E71,seznam!$A$2:$F$5009,3,FALSE))","v":""},null,{"$f":"IF(E71=0,\"\",VLOOKUP($E71,seznam!$A$2:$F$5009,4,FALSE))","v":""},{"$f":"IF(E71=0,\"\",VLOOKUP($E71,seznam!$A$2:$F$5009,5,FALSE))","v":""},null,null,null,null,null,null,null,null,"","","","","",{"$f":"IF(E71=0,\"\",IF(ROUND('typ turnaje'!$G$24+(+$V$3-$Q71)/'typ turnaje'!$H$24,0)>0,ROUND('typ turnaje'!$G$24+(+$V$3-$Q71)/'typ turnaje'!$H$24,0),0))","v":""}]
["",71,{"$f":"IF(E72=0,\"\",VLOOKUP($E72,seznam!$A$2:$F$5009,2,FALSE))","v":""},{"$f":"IF(E72=0,\"\",VLOOKUP($E72,seznam!$A$2:$F$5009,3,FALSE))","v":""},null,{"$f":"IF(E72=0,\"\",VLOOKUP($E72,seznam!$A$2:$F$5009,4,FALSE))","v":""},{"$f":"IF(E72=0,\"\",VLOOKUP($E72,seznam!$A$2:$F$5009,5,FALSE))","v":""},null,null,null,null,null,null,null,null,"","","","","",{"$f":"IF(E72=0,\"\",IF(ROUND('typ turnaje'!$G$24+(+$V$3-$Q72)/'typ turnaje'!$H$24,0)>0,ROUND('typ turnaje'!$G$24+(+$V$3-$Q72)/'typ turnaje'!$H$24,0),0))","v":""}]
["",72,{"$f":"IF(E73=0,\"\",VLOOKUP($E73,seznam!$A$2:$F$5009,2,FALSE))","v":""},{"$f":"IF(E73=0,\"\",VLOOKUP($E73,seznam!$A$2:$F$5009,3,FALSE))","v":""},null,{"$f":"IF(E73=0,\"\",VLOOKUP($E73,seznam!$A$2:$F$5009,4,FALSE))","v":""},{"$f":"IF(E73=0,\"\",VLOOKUP($E73,seznam!$A$2:$F$5009,5,FALSE))","v":""},null,null,null,null,null,null,null,null,"","","","","",{"$f":"IF(E73=0,\"\",IF(ROUND('typ turnaje'!$G$24+(+$V$3-$Q73)/'typ turnaje'!$H$24,0)>0,ROUND('typ turnaje'!$G$24+(+$V$3-$Q73)/'typ turnaje'!$H$24,0),0))","v":""}]
["",73,{"$f":"IF(E74=0,\"\",VLOOKUP($E74,seznam!$A$2:$F$5009,2,FALSE))","v":""},{"$f":"IF(E74=0,\"\",VLOOKUP($E74,seznam!$A$2:$F$5009,3,FALSE))","v":""},null,{"$f":"IF(E74=0,\"\",VLOOKUP($E74,seznam!$A$2:$F$5009,4,FALSE))","v":""},{"$f":"IF(E74=0,\"\",VLOOKUP($E74,seznam!$A$2:$F$5009,5,FALSE))","v":""},null,null,null,null,null,null,null,null,"","","","","",{"$f":"IF(E74=0,\"\",IF(ROUND('typ turnaje'!$G$24+(+$V$3-$Q74)/'typ turnaje'!$H$24,0)>0,ROUND('typ turnaje'!$G$24+(+$V$3-$Q74)/'typ turnaje'!$H$24,0),0))","v":""}]
["",74,{"$f":"IF(E75=0,\"\",VLOOKUP($E75,seznam!$A$2:$F$5009,2,FALSE))","v":""},{"$f":"IF(E75=0,\"\",VLOOKUP($E75,seznam!$A$2:$F$5009,3,FALSE))","v":""},null,{"$f":"IF(E75=0,\"\",VLOOKUP($E75,seznam!$A$2:$F$5009,4,FALSE))","v":""},{"$f":"IF(E75=0,\"\",VLOOKUP($E75,seznam!$A$2:$F$5009,5,FALSE))","v":""},null,null,null,null,null,null,null,null,"","","","","",{"$f":"IF(E75=0,\"\",IF(ROUND('typ turnaje'!$G$24+(+$V$3-$Q75)/'typ turnaje'!$H$24,0)>0,ROUND('typ turnaje'!$G$24+(+$V$3-$Q75)/'typ turnaje'!$H$24,0),0))","v":""}]
["",75,{"$f":"IF(E76=0,\"\",VLOOKUP($E76,seznam!$A$2:$F$5009,2,FALSE))","v":""},{"$f":"IF(E76=0,\"\",VLOOKUP($E76,seznam!$A$2:$F$5009,3,FALSE))","v":""},null,{"$f":"IF(E76=0,\"\",VLOOKUP($E76,seznam!$A$2:$F$5009,4,FALSE))","v":""},{"$f":"IF(E76=0,\"\",VLOOKUP($E76,seznam!$A$2:$F$5009,5,FALSE))","v":""},null,null,null,null,null,null,null,null,"","","","","",{"$f":"IF(E76=0,\"\",IF(ROUND('typ turnaje'!$G$24+(+$V$3-$Q76)/'typ turnaje'!$H$24,0)>0,ROUND('typ turnaje'!$G$24+(+$V$3-$Q76)/'typ turnaje'!$H$24,0),0))","v":""}]
["",76,{"$f":"IF(E77=0,\"\",VLOOKUP($E77,seznam!$A$2:$F$5009,2,FALSE))","v":""},{"$f":"IF(E77=0,\"\",VLOOKUP($E77,seznam!$A$2:$F$5009,3,FALSE))","v":""},null,{"$f":"IF(E77=0,\"\",VLOOKUP($E77,seznam!$A$2:$F$5009,4,FALSE))","v":""},{"$f":"IF(E77=0,\"\",VLOOKUP($E77,seznam!$A$2:$F$5009,5,FALSE))","v":""},null,null,null,null,null,null,null,null,"","","","","",{"$f":"IF(E77=0,\"\",IF(ROUND('typ turnaje'!$G$24+(+$V$3-$Q77)/'typ turnaje'!$H$24,0)>0,ROUND('typ turnaje'!$G$24+(+$V$3-$Q77)/'typ turnaje'!$H$24,0),0))","v":""}]
["",77,{"$f":"IF(E78=0,\"\",VLOOKUP($E78,seznam!$A$2:$F$5009,2,FALSE))","v":""},{"$f":"IF(E78=0,\"\",VLOOKUP($E78,seznam!$A$2:$F$5009,3,FALSE))","v":""},null,{"$f":"IF(E78=0,\"\",VLOOKUP($E78,seznam!$A$2:$F$5009,4,FALSE))","v":""},{"$f":"IF(E78=0,\"\",VLOOKUP($E78,seznam!$A$2:$F$5009,5,FALSE))","v":""},null,null,null,null,null,null,null,null,"","","","","",{"$f":"IF(E78=0,\"\",IF(ROUND('typ turnaje'!$G$24+(+$V$3-$Q78)/'typ turnaje'!$H$24,0)>0,ROUND('typ turnaje'!$G$24+(+$V$3-$Q78)/'typ turnaje'!$H$24,0),0))","v":""}]
["",78,{"$f":"IF(E79=0,\"\",VLOOKUP($E79,seznam!$A$2:$F$5009,2,FALSE))","v":""},{"$f":"IF(E79=0,\"\",VLOOKUP($E79,seznam!$A$2:$F$5009,3,FALSE))","v":""},null,{"$f":"IF(E79=0,\"\",VLOOKUP($E79,seznam!$A$2:$F$5009,4,FALSE))","v":""},{"$f":"IF(E79=0,\"\",VLOOKUP($E79,seznam!$A$2:$F$5009,5,FALSE))","v":""},null,null,null,null,null,null,null,null,"","","","","",{"$f":"IF(E79=0,\"\",IF(ROUND('typ turnaje'!$G$24+(+$V$3-$Q79)/'typ turnaje'!$H$24,0)>0,ROUND('typ turnaje'!$G$24+(+$V$3-$Q79)/'typ turnaje'!$H$24,0),0))","v":""}]
["",79,{"$f":"IF(E80=0,\"\",VLOOKUP($E80,seznam!$A$2:$F$5009,2,FALSE))","v":""},{"$f":"IF(E80=0,\"\",VLOOKUP($E80,seznam!$A$2:$F$5009,3,FALSE))","v":""},null,{"$f":"IF(E80=0,\"\",VLOOKUP($E80,seznam!$A$2:$F$5009,4,FALSE))","v":""},{"$f":"IF(E80=0,\"\",VLOOKUP($E80,seznam!$A$2:$F$5009,5,FALSE))","v":""},null,null,null,null,null,null,null,null,"","","","","",{"$f":"IF(E80=0,\"\",IF(ROUND('typ turnaje'!$G$24+(+$V$3-$Q80)/'typ turnaje'!$H$24,0)>0,ROUND('typ turnaje'!$G$24+(+$V$3-$Q80)/'typ turnaje'!$H$24,0),0))","v":""}]
["",80,{"$f":"IF(E81=0,\"\",VLOOKUP($E81,seznam!$A$2:$F$5009,2,FALSE))","v":""},{"$f":"IF(E81=0,\"\",VLOOKUP($E81,seznam!$A$2:$F$5009,3,FALSE))","v":""},null,{"$f":"IF(E81=0,\"\",VLOOKUP($E81,seznam!$A$2:$F$5009,4,FALSE))","v":""},{"$f":"IF(E81=0,\"\",VLOOKUP($E81,seznam!$A$2:$F$5009,5,FALSE))","v":""},null,null,null,null,null,null,null,null,"","","","","",{"$f":"IF(E81=0,\"\",IF(ROUND('typ turnaje'!$G$24+(+$V$3-$Q81)/'typ turnaje'!$H$24,0)>0,ROUND('typ turnaje'!$G$24+(+$V$3-$Q81)/'typ turnaje'!$H$24,0),0))","v":""}]
["",81,{"$f":"IF(E82=0,\"\",VLOOKUP($E82,seznam!$A$2:$F$5009,2,FALSE))","v":""},{"$f":"IF(E82=0,\"\",VLOOKUP($E82,seznam!$A$2:$F$5009,3,FALSE))","v":""},null,{"$f":"IF(E82=0,\"\",VLOOKUP($E82,seznam!$A$2:$F$5009,4,FALSE))","v":""},{"$f":"IF(E82=0,\"\",VLOOKUP($E82,seznam!$A$2:$F$5009,5,FALSE))","v":""},null,null,null,null,null,null,null,null,"","","","","",{"$f":"IF(E82=0,\"\",IF(ROUND('typ turnaje'!$G$24+(+$V$3-$Q82)/'typ turnaje'!$H$24,0)>0,ROUND('typ turnaje'!$G$24+(+$V$3-$Q82)/'typ turnaje'!$H$24,0),0))","v":""}]
["",82,{"$f":"IF(E83=0,\"\",VLOOKUP($E83,seznam!$A$2:$F$5009,2,FALSE))","v":""},{"$f":"IF(E83=0,\"\",VLOOKUP($E83,seznam!$A$2:$F$5009,3,FALSE))","v":""},null,{"$f":"IF(E83=0,\"\",VLOOKUP($E83,seznam!$A$2:$F$5009,4,FALSE))","v":""},{"$f":"IF(E83=0,\"\",VLOOKUP($E83,seznam!$A$2:$F$5009,5,FALSE))","v":""},null,null,null,null,null,null,null,null,"","","","","",{"$f":"IF(E83=0,\"\",IF(ROUND('typ turnaje'!$G$24+(+$V$3-$Q83)/'typ turnaje'!$H$24,0)>0,ROUND('typ turnaje'!$G$24+(+$V$3-$Q83)/'typ turnaje'!$H$24,0),0))","v":""}]
["",83,{"$f":"IF(E84=0,\"\",VLOOKUP($E84,seznam!$A$2:$F$5009,2,FALSE))","v":""},{"$f":"IF(E84=0,\"\",VLOOKUP($E84,seznam!$A$2:$F$5009,3,FALSE))","v":""},null,{"$f":"IF(E84=0,\"\",VLOOKUP($E84,seznam!$A$2:$F$5009,4,FALSE))","v":""},{"$f":"IF(E84=0,\"\",VLOOKUP($E84,seznam!$A$2:$F$5009,5,FALSE))","v":""},null,null,null,null,null,null,null,null,"","","","","",{"$f":"IF(E84=0,\"\",IF(ROUND('typ turnaje'!$G$24+(+$V$3-$Q84)/'typ turnaje'!$H$24,0)>0,ROUND('typ turnaje'!$G$24+(+$V$3-$Q84)/'typ turnaje'!$H$24,0),0))","v":""}]
["",84,{"$f":"IF(E85=0,\"\",VLOOKUP($E85,seznam!$A$2:$F$5009,2,FALSE))","v":""},{"$f":"IF(E85=0,\"\",VLOOKUP($E85,seznam!$A$2:$F$5009,3,FALSE))","v":""},null,{"$f":"IF(E85=0,\"\",VLOOKUP($E85,seznam!$A$2:$F$5009,4,FALSE))","v":""},{"$f":"IF(E85=0,\"\",VLOOKUP($E85,seznam!$A$2:$F$5009,5,FALSE))","v":""},null,null,null,null,null,null,null,null,"","","","","",{"$f":"IF(E85=0,\"\",IF(ROUND('typ turnaje'!$G$24+(+$V$3-$Q85)/'typ turnaje'!$H$24,0)>0,ROUND('typ turnaje'!$G$24+(+$V$3-$Q85)/'typ turnaje'!$H$24,0),0))","v":""}]
["",85,{"$f":"IF(E86=0,\"\",VLOOKUP($E86,seznam!$A$2:$F$5009,2,FALSE))","v":""},{"$f":"IF(E86=0,\"\",VLOOKUP($E86,seznam!$A$2:$F$5009,3,FALSE))","v":""},null,{"$f":"IF(E86=0,\"\",VLOOKUP($E86,seznam!$A$2:$F$5009,4,FALSE))","v":""},{"$f":"IF(E86=0,\"\",VLOOKUP($E86,seznam!$A$2:$F$5009,5,FALSE))","v":""},null,null,null,null,null,null,null,null,"","","","","",{"$f":"IF(E86=0,\"\",IF(ROUND('typ turnaje'!$G$24+(+$V$3-$Q86)/'typ turnaje'!$H$24,0)>0,ROUND('typ turnaje'!$G$24+(+$V$3-$Q86)/'typ turnaje'!$H$24,0),0))","v":""}]
["",86,{"$f":"IF(E87=0,\"\",VLOOKUP($E87,seznam!$A$2:$F$5009,2,FALSE))","v":""},{"$f":"IF(E87=0,\"\",VLOOKUP($E87,seznam!$A$2:$F$5009,3,FALSE))","v":""},null,{"$f":"IF(E87=0,\"\",VLOOKUP($E87,seznam!$A$2:$F$5009,4,FALSE))","v":""},{"$f":"IF(E87=0,\"\",VLOOKUP($E87,seznam!$A$2:$F$5009,5,FALSE))","v":""},null,null,null,null,null,null,null,null,"","","","","",{"$f":"IF(E87=0,\"\",IF(ROUND('typ turnaje'!$G$24+(+$V$3-$Q87)/'typ turnaje'!$H$24,0)>0,ROUND('typ turnaje'!$G$24+(+$V$3-$Q87)/'typ turnaje'!$H$24,0),0))","v":""}]
["",87,{"$f":"IF(E88=0,\"\",VLOOKUP($E88,seznam!$A$2:$F$5009,2,FALSE))","v":""},{"$f":"IF(E88=0,\"\",VLOOKUP($E88,seznam!$A$2:$F$5009,3,FALSE))","v":""},null,{"$f":"IF(E88=0,\"\",VLOOKUP($E88,seznam!$A$2:$F$5009,4,FALSE))","v":""},{"$f":"IF(E88=0,\"\",VLOOKUP($E88,seznam!$A$2:$F$5009,5,FALSE))","v":""},null,null,null,null,null,null,null,null,"","","","","",{"$f":"IF(E88=0,\"\",IF(ROUND('typ turnaje'!$G$24+(+$V$3-$Q88)/'typ turnaje'!$H$24,0)>0,ROUND('typ turnaje'!$G$24+(+$V$3-$Q88)/'typ turnaje'!$H$24,0),0))","v":""}]
["",88,{"$f":"IF(E89=0,\"\",VLOOKUP($E89,seznam!$A$2:$F$5009,2,FALSE))","v":""},{"$f":"IF(E89=0,\"\",VLOOKUP($E89,seznam!$A$2:$F$5009,3,FALSE))","v":""},null,{"$f":"IF(E89=0,\"\",VLOOKUP($E89,seznam!$A$2:$F$5009,4,FALSE))","v":""},{"$f":"IF(E89=0,\"\",VLOOKUP($E89,seznam!$A$2:$F$5009,5,FALSE))","v":""},null,null,null,null,null,null,null,null,"","","","","",{"$f":"IF(E89=0,\"\",IF(ROUND('typ turnaje'!$G$24+(+$V$3-$Q89)/'typ turnaje'!$H$24,0)>0,ROUND('typ turnaje'!$G$24+(+$V$3-$Q89)/'typ turnaje'!$H$24,0),0))","v":""}]
["",89,{"$f":"IF(E90=0,\"\",VLOOKUP($E90,seznam!$A$2:$F$5009,2,FALSE))","v":""},{"$f":"IF(E90=0,\"\",VLOOKUP($E90,seznam!$A$2:$F$5009,3,FALSE))","v":""},null,{"$f":"IF(E90=0,\"\",VLOOKUP($E90,seznam!$A$2:$F$5009,4,FALSE))","v":""},{"$f":"IF(E90=0,\"\",VLOOKUP($E90,seznam!$A$2:$F$5009,5,FALSE))","v":""},null,null,null,null,null,null,null,null,"","","","","",{"$f":"IF(E90=0,\"\",IF(ROUND('typ turnaje'!$G$24+(+$V$3-$Q90)/'typ turnaje'!$H$24,0)>0,ROUND('typ turnaje'!$G$24+(+$V$3-$Q90)/'typ turnaje'!$H$24,0),0))","v":""}]
["",90,{"$f":"IF(E91=0,\"\",VLOOKUP($E91,seznam!$A$2:$F$5009,2,FALSE))","v":""},{"$f":"IF(E91=0,\"\",VLOOKUP($E91,seznam!$A$2:$F$5009,3,FALSE))","v":""},null,{"$f":"IF(E91=0,\"\",VLOOKUP($E91,seznam!$A$2:$F$5009,4,FALSE))","v":""},{"$f":"IF(E91=0,\"\",VLOOKUP($E91,seznam!$A$2:$F$5009,5,FALSE))","v":""},null,null,null,null,null,null,null,null,"","","","","",{"$f":"IF(E91=0,\"\",IF(ROUND('typ turnaje'!$G$24+(+$V$3-$Q91)/'typ turnaje'!$H$24,0)>0,ROUND('typ turnaje'!$G$24+(+$V$3-$Q91)/'typ turnaje'!$H$24,0),0))","v":""}]
["",91,{"$f":"IF(E92=0,\"\",VLOOKUP($E92,seznam!$A$2:$F$5009,2,FALSE))","v":""},{"$f":"IF(E92=0,\"\",VLOOKUP($E92,seznam!$A$2:$F$5009,3,FALSE))","v":""},null,{"$f":"IF(E92=0,\"\",VLOOKUP($E92,seznam!$A$2:$F$5009,4,FALSE))","v":""},{"$f":"IF(E92=0,\"\",VLOOKUP($E92,seznam!$A$2:$F$5009,5,FALSE))","v":""},null,null,null,null,null,null,null,null,"","","","","",{"$f":"IF(E92=0,\"\",IF(ROUND('typ turnaje'!$G$24+(+$V$3-$Q92)/'typ turnaje'!$H$24,0)>0,ROUND('typ turnaje'!$G$24+(+$V$3-$Q92)/'typ turnaje'!$H$24,0),0))","v":""}]
["",92,{"$f":"IF(E93=0,\"\",VLOOKUP($E93,seznam!$A$2:$F$5009,2,FALSE))","v":""},{"$f":"IF(E93=0,\"\",VLOOKUP($E93,seznam!$A$2:$F$5009,3,FALSE))","v":""},null,{"$f":"IF(E93=0,\"\",VLOOKUP($E93,seznam!$A$2:$F$5009,4,FALSE))","v":""},{"$f":"IF(E93=0,\"\",VLOOKUP($E93,seznam!$A$2:$F$5009,5,FALSE))","v":""},null,null,null,null,null,null,null,null,"","","","","",{"$f":"IF(E93=0,\"\",IF(ROUND('typ turnaje'!$G$24+(+$V$3-$Q93)/'typ turnaje'!$H$24,0)>0,ROUND('typ turnaje'!$G$24+(+$V$3-$Q93)/'typ turnaje'!$H$24,0),0))","v":""}]
["",93,{"$f":"IF(E94=0,\"\",VLOOKUP($E94,seznam!$A$2:$F$5009,2,FALSE))","v":""},{"$f":"IF(E94=0,\"\",VLOOKUP($E94,seznam!$A$2:$F$5009,3,FALSE))","v":""},null,{"$f":"IF(E94=0,\"\",VLOOKUP($E94,seznam!$A$2:$F$5009,4,FALSE))","v":""},{"$f":"IF(E94=0,\"\",VLOOKUP($E94,seznam!$A$2:$F$5009,5,FALSE))","v":""},null,null,null,null,null,null,null,null,"","","","","",{"$f":"IF(E94=0,\"\",IF(ROUND('typ turnaje'!$G$24+(+$V$3-$Q94)/'typ turnaje'!$H$24,0)>0,ROUND('typ turnaje'!$G$24+(+$V$3-$Q94)/'typ turnaje'!$H$24,0),0))","v":""}]
["",94,{"$f":"IF(E95=0,\"\",VLOOKUP($E95,seznam!$A$2:$F$5009,2,FALSE))","v":""},{"$f":"IF(E95=0,\"\",VLOOKUP($E95,seznam!$A$2:$F$5009,3,FALSE))","v":""},null,{"$f":"IF(E95=0,\"\",VLOOKUP($E95,seznam!$A$2:$F$5009,4,FALSE))","v":""},{"$f":"IF(E95=0,\"\",VLOOKUP($E95,seznam!$A$2:$F$5009,5,FALSE))","v":""},null,null,null,null,null,null,null,null,"","","","","",{"$f":"IF(E95=0,\"\",IF(ROUND('typ turnaje'!$G$24+(+$V$3-$Q95)/'typ turnaje'!$H$24,0)>0,ROUND('typ turnaje'!$G$24+(+$V$3-$Q95)/'typ turnaje'!$H$24,0),0))","v":""}]
["",95,{"$f":"IF(E96=0,\"\",VLOOKUP($E96,seznam!$A$2:$F$5009,2,FALSE))","v":""},{"$f":"IF(E96=0,\"\",VLOOKUP($E96,seznam!$A$2:$F$5009,3,FALSE))","v":""},null,{"$f":"IF(E96=0,\"\",VLOOKUP($E96,seznam!$A$2:$F$5009,4,FALSE))","v":""},{"$f":"IF(E96=0,\"\",VLOOKUP($E96,seznam!$A$2:$F$5009,5,FALSE))","v":""},null,null,null,null,null,null,null,null,"","","","","",{"$f":"IF(E96=0,\"\",IF(ROUND('typ turnaje'!$G$24+(+$V$3-$Q96)/'typ turnaje'!$H$24,0)>0,ROUND('typ turnaje'!$G$24+(+$V$3-$Q96)/'typ turnaje'!$H$24,0),0))","v":""}]
["",96,{"$f":"IF(E97=0,\"\",VLOOKUP($E97,seznam!$A$2:$F$5009,2,FALSE))","v":""},{"$f":"IF(E97=0,\"\",VLOOKUP($E97,seznam!$A$2:$F$5009,3,FALSE))","v":""},null,{"$f":"IF(E97=0,\"\",VLOOKUP($E97,seznam!$A$2:$F$5009,4,FALSE))","v":""},{"$f":"IF(E97=0,\"\",VLOOKUP($E97,seznam!$A$2:$F$5009,5,FALSE))","v":""},null,null,null,null,null,null,null,null,"","","","","",{"$f":"IF(E97=0,\"\",IF(ROUND('typ turnaje'!$G$24+(+$V$3-$Q97)/'typ turnaje'!$H$24,0)>0,ROUND('typ turnaje'!$G$24+(+$V$3-$Q97)/'typ turnaje'!$H$24,0),0))","v":""}]
["",97,{"$f":"IF(E98=0,\"\",VLOOKUP($E98,seznam!$A$2:$F$5009,2,FALSE))","v":""},{"$f":"IF(E98=0,\"\",VLOOKUP($E98,seznam!$A$2:$F$5009,3,FALSE))","v":""},null,{"$f":"IF(E98=0,\"\",VLOOKUP($E98,seznam!$A$2:$F$5009,4,FALSE))","v":""},{"$f":"IF(E98=0,\"\",VLOOKUP($E98,seznam!$A$2:$F$5009,5,FALSE))","v":""},null,null,null,null,null,null,null,null,{"$f":"IF(E98=0,\"\",SUM(H98:O98))","v":""},{"$f":"IF(E98=0,\"\",+P98/COUNT(H98:O98))","v":""},{"$f":"IF(E98=0,\"\",MAX($H98:$O98)-MIN($H98:$O98))","v":""},{"$f":"IF(E98=0,\"\",LARGE($H98:$O98,2)-SMALL($H98:$O98,2))","v":""},{"$f":"IF(E98=0,\"\",+COUNT(H98:O98))","v":""},{"$f":"IF(E98=0,\"\",IF(ROUND('typ turnaje'!$G$24+(+$V$3-$Q98)/'typ turnaje'!$H$24,0)>0,ROUND('typ turnaje'!$G$24+(+$V$3-$Q98)/'typ turnaje'!$H$24,0),0))","v":""}]
[{"$f":"IF(E99=0,\"\",A98+1)","v":""},98,{"$f":"IF(E99=0,\"\",VLOOKUP($E99,seznam!$A$2:$F$5009,2,FALSE))","v":""},{"$f":"IF(E99=0,\"\",VLOOKUP($E99,seznam!$A$2:$F$5009,3,FALSE))","v":""},null,{"$f":"IF(E99=0,\"\",VLOOKUP($E99,seznam!$A$2:$F$5009,4,FALSE))","v":""},{"$f":"IF(E99=0,\"\",VLOOKUP($E99,seznam!$A$2:$F$5009,5,FALSE))","v":""},null,null,null,null,null,null,null,null,"","","","","",{"$f":"IF(E99=0,\"\",IF(ROUND('typ turnaje'!$G$24+(+$V$3-$Q99)/'typ turnaje'!$H$24,0)>0,ROUND('typ turnaje'!$G$24+(+$V$3-$Q99)/'typ turnaje'!$H$24,0),0))","v":""}]
["",99,{"$f":"IF(E100=0,\"\",VLOOKUP($E100,seznam!$A$2:$F$5009,2,FALSE))","v":""},{"$f":"IF(E100=0,\"\",VLOOKUP($E100,seznam!$A$2:$F$5009,3,FALSE))","v":""},null,{"$f":"IF(E100=0,\"\",VLOOKUP($E100,seznam!$A$2:$F$5009,4,FALSE))","v":""},{"$f":"IF(E100=0,\"\",VLOOKUP($E100,seznam!$A$2:$F$5009,5,FALSE))","v":""},null,null,null,null,null,null,null,null,"","","","","",{"$f":"IF(E100=0,\"\",IF(ROUND('typ turnaje'!$G$24+(+$V$3-$Q100)/'typ turnaje'!$H$24,0)>0,ROUND('typ turnaje'!$G$24+(+$V$3-$Q100)/'typ turnaje'!$H$24,0),0))","v":""}]
["",100,{"$f":"IF(E101=0,\"\",VLOOKUP($E101,seznam!$A$2:$F$5009,2,FALSE))","v":""},{"$f":"IF(E101=0,\"\",VLOOKUP($E101,seznam!$A$2:$F$5009,3,FALSE))","v":""},null,{"$f":"IF(E101=0,\"\",VLOOKUP($E101,seznam!$A$2:$F$5009,4,FALSE))","v":""},{"$f":"IF(E101=0,\"\",VLOOKUP($E101,seznam!$A$2:$F$5009,5,FALSE))","v":""},null,null,null,null,null,null,null,null,"","","","","",{"$f":"IF(E101=0,\"\",IF(ROUND('typ turnaje'!$G$24+(+$V$3-$Q101)/'typ turnaje'!$H$24,0)>0,ROUND('typ turnaje'!$G$24+(+$V$3-$Q101)/'typ turnaje'!$H$24,0),0))","v":""}]
["",101,{"$f":"IF(E102=0,\"\",VLOOKUP($E102,seznam!$A$2:$F$5009,2,FALSE))","v":""},{"$f":"IF(E102=0,\"\",VLOOKUP($E102,seznam!$A$2:$F$5009,3,FALSE))","v":""},null,{"$f":"IF(E102=0,\"\",VLOOKUP($E102,seznam!$A$2:$F$5009,4,FALSE))","v":""},{"$f":"IF(E102=0,\"\",VLOOKUP($E102,seznam!$A$2:$F$5009,5,FALSE))","v":""},null,null,null,null,null,null,null,null,"","","","","",{"$f":"IF(E102=0,\"\",IF(ROUND('typ turnaje'!$G$24+(+$V$3-$Q102)/'typ turnaje'!$H$24,0)>0,ROUND('typ turnaje'!$G$24+(+$V$3-$Q102)/'typ turnaje'!$H$24,0),0))","v":""}]
["",102,{"$f":"IF(E103=0,\"\",VLOOKUP($E103,seznam!$A$2:$F$5009,2,FALSE))","v":""},{"$f":"IF(E103=0,\"\",VLOOKUP($E103,seznam!$A$2:$F$5009,3,FALSE))","v":""},null,{"$f":"IF(E103=0,\"\",VLOOKUP($E103,seznam!$A$2:$F$5009,4,FALSE))","v":""},{"$f":"IF(E103=0,\"\",VLOOKUP($E103,seznam!$A$2:$F$5009,5,FALSE))","v":""},null,null,null,null,null,null,null,null,"","","","","",{"$f":"IF(E103=0,\"\",IF(ROUND('typ turnaje'!$G$24+(+$V$3-$Q103)/'typ turnaje'!$H$24,0)>0,ROUND('typ turnaje'!$G$24+(+$V$3-$Q103)/'typ turnaje'!$H$24,0),0))","v":""}]
["",103,{"$f":"IF(E104=0,\"\",VLOOKUP($E104,seznam!$A$2:$F$5009,2,FALSE))","v":""},{"$f":"IF(E104=0,\"\",VLOOKUP($E104,seznam!$A$2:$F$5009,3,FALSE))","v":""},null,{"$f":"IF(E104=0,\"\",VLOOKUP($E104,seznam!$A$2:$F$5009,4,FALSE))","v":""},{"$f":"IF(E104=0,\"\",VLOOKUP($E104,seznam!$A$2:$F$5009,5,FALSE))","v":""},null,null,null,null,null,null,null,null,"","","","","",{"$f":"IF(E104=0,\"\",IF(ROUND('typ turnaje'!$G$24+(+$V$3-$Q104)/'typ turnaje'!$H$24,0)>0,ROUND('typ turnaje'!$G$24+(+$V$3-$Q104)/'typ turnaje'!$H$24,0),0))","v":""}]
["",104,{"$f":"IF(E105=0,\"\",VLOOKUP($E105,seznam!$A$2:$F$5009,2,FALSE))","v":""},{"$f":"IF(E105=0,\"\",VLOOKUP($E105,seznam!$A$2:$F$5009,3,FALSE))","v":""},null,{"$f":"IF(E105=0,\"\",VLOOKUP($E105,seznam!$A$2:$F$5009,4,FALSE))","v":""},{"$f":"IF(E105=0,\"\",VLOOKUP($E105,seznam!$A$2:$F$5009,5,FALSE))","v":""},null,null,null,null,null,null,null,null,"","","","","",{"$f":"IF(E105=0,\"\",IF(ROUND('typ turnaje'!$G$24+(+$V$3-$Q105)/'typ turnaje'!$H$24,0)>0,ROUND('typ turnaje'!$G$24+(+$V$3-$Q105)/'typ turnaje'!$H$24,0),0))","v":""}]
["",105,{"$f":"IF(E106=0,\"\",VLOOKUP($E106,seznam!$A$2:$F$5009,2,FALSE))","v":""},{"$f":"IF(E106=0,\"\",VLOOKUP($E106,seznam!$A$2:$F$5009,3,FALSE))","v":""},null,{"$f":"IF(E106=0,\"\",VLOOKUP($E106,seznam!$A$2:$F$5009,4,FALSE))","v":""},{"$f":"IF(E106=0,\"\",VLOOKUP($E106,seznam!$A$2:$F$5009,5,FALSE))","v":""},null,null,null,null,null,null,null,null,"","","","","",{"$f":"IF(E106=0,\"\",IF(ROUND('typ turnaje'!$G$24+(+$V$3-$Q106)/'typ turnaje'!$H$24,0)>0,ROUND('typ turnaje'!$G$24+(+$V$3-$Q106)/'typ turnaje'!$H$24,0),0))","v":""}]
["",106,{"$f":"IF(E107=0,\"\",VLOOKUP($E107,seznam!$A$2:$F$5009,2,FALSE))","v":""},{"$f":"IF(E107=0,\"\",VLOOKUP($E107,seznam!$A$2:$F$5009,3,FALSE))","v":""},null,{"$f":"IF(E107=0,\"\",VLOOKUP($E107,seznam!$A$2:$F$5009,4,FALSE))","v":""},{"$f":"IF(E107=0,\"\",VLOOKUP($E107,seznam!$A$2:$F$5009,5,FALSE))","v":""},null,null,null,null,null,null,null,null,"","","","","",{"$f":"IF(E107=0,\"\",IF(ROUND('typ turnaje'!$G$24+(+$V$3-$Q107)/'typ turnaje'!$H$24,0)>0,ROUND('typ turnaje'!$G$24+(+$V$3-$Q107)/'typ turnaje'!$H$24,0),0))","v":""}]
["",107,{"$f":"IF(E108=0,\"\",VLOOKUP($E108,seznam!$A$2:$F$5009,2,FALSE))","v":""},{"$f":"IF(E108=0,\"\",VLOOKUP($E108,seznam!$A$2:$F$5009,3,FALSE))","v":""},null,{"$f":"IF(E108=0,\"\",VLOOKUP($E108,seznam!$A$2:$F$5009,4,FALSE))","v":""},{"$f":"IF(E108=0,\"\",VLOOKUP($E108,seznam!$A$2:$F$5009,5,FALSE))","v":""},null,null,null,null,null,null,null,null,"","","","","",{"$f":"IF(E108=0,\"\",IF(ROUND('typ turnaje'!$G$24+(+$V$3-$Q108)/'typ turnaje'!$H$24,0)>0,ROUND('typ turnaje'!$G$24+(+$V$3-$Q108)/'typ turnaje'!$H$24,0),0))","v":""}]
["",108,{"$f":"IF(E109=0,\"\",VLOOKUP($E109,seznam!$A$2:$F$5009,2,FALSE))","v":""},{"$f":"IF(E109=0,\"\",VLOOKUP($E109,seznam!$A$2:$F$5009,3,FALSE))","v":""},null,{"$f":"IF(E109=0,\"\",VLOOKUP($E109,seznam!$A$2:$F$5009,4,FALSE))","v":""},{"$f":"IF(E109=0,\"\",VLOOKUP($E109,seznam!$A$2:$F$5009,5,FALSE))","v":""},null,null,null,null,null,null,null,null,"","","","","",{"$f":"IF(E109=0,\"\",IF(ROUND('typ turnaje'!$G$24+(+$V$3-$Q109)/'typ turnaje'!$H$24,0)>0,ROUND('typ turnaje'!$G$24+(+$V$3-$Q109)/'typ turnaje'!$H$24,0),0))","v":""}]
["",109,{"$f":"IF(E110=0,\"\",VLOOKUP($E110,seznam!$A$2:$F$5009,2,FALSE))","v":""},{"$f":"IF(E110=0,\"\",VLOOKUP($E110,seznam!$A$2:$F$5009,3,FALSE))","v":""},null,{"$f":"IF(E110=0,\"\",VLOOKUP($E110,seznam!$A$2:$F$5009,4,FALSE))","v":""},{"$f":"IF(E110=0,\"\",VLOOKUP($E110,seznam!$A$2:$F$5009,5,FALSE))","v":""},null,null,null,null,null,null,null,null,"","","","","",{"$f":"IF(E110=0,\"\",IF(ROUND('typ turnaje'!$G$24+(+$V$3-$Q110)/'typ turnaje'!$H$24,0)>0,ROUND('typ turnaje'!$G$24+(+$V$3-$Q110)/'typ turnaje'!$H$24,0),0))","v":""}]
["",110,{"$f":"IF(E111=0,\"\",VLOOKUP($E111,seznam!$A$2:$F$5009,2,FALSE))","v":""},{"$f":"IF(E111=0,\"\",VLOOKUP($E111,seznam!$A$2:$F$5009,3,FALSE))","v":""},null,{"$f":"IF(E111=0,\"\",VLOOKUP($E111,seznam!$A$2:$F$5009,4,FALSE))","v":""},{"$f":"IF(E111=0,\"\",VLOOKUP($E111,seznam!$A$2:$F$5009,5,FALSE))","v":""},null,null,null,null,null,null,null,null,"","","","","",{"$f":"IF(E111=0,\"\",IF(ROUND('typ turnaje'!$G$24+(+$V$3-$Q111)/'typ turnaje'!$H$24,0)>0,ROUND('typ turnaje'!$G$24+(+$V$3-$Q111)/'typ turnaje'!$H$24,0),0))","v":""}]
["",111,{"$f":"IF(E112=0,\"\",VLOOKUP($E112,seznam!$A$2:$F$5009,2,FALSE))","v":""},{"$f":"IF(E112=0,\"\",VLOOKUP($E112,seznam!$A$2:$F$5009,3,FALSE))","v":""},null,{"$f":"IF(E112=0,\"\",VLOOKUP($E112,seznam!$A$2:$F$5009,4,FALSE))","v":""},{"$f":"IF(E112=0,\"\",VLOOKUP($E112,seznam!$A$2:$F$5009,5,FALSE))","v":""},null,null,null,null,null,null,null,null,"","","","","",{"$f":"IF(E112=0,\"\",IF(ROUND('typ turnaje'!$G$24+(+$V$3-$Q112)/'typ turnaje'!$H$24,0)>0,ROUND('typ turnaje'!$G$24+(+$V$3-$Q112)/'typ turnaje'!$H$24,0),0))","v":""}]
["",112,{"$f":"IF(E113=0,\"\",VLOOKUP($E113,seznam!$A$2:$F$5009,2,FALSE))","v":""},{"$f":"IF(E113=0,\"\",VLOOKUP($E113,seznam!$A$2:$F$5009,3,FALSE))","v":""},null,{"$f":"IF(E113=0,\"\",VLOOKUP($E113,seznam!$A$2:$F$5009,4,FALSE))","v":""},{"$f":"IF(E113=0,\"\",VLOOKUP($E113,seznam!$A$2:$F$5009,5,FALSE))","v":""},null,null,null,null,null,null,null,null,"","","","","",{"$f":"IF(E113=0,\"\",IF(ROUND('typ turnaje'!$G$24+(+$V$3-$Q113)/'typ turnaje'!$H$24,0)>0,ROUND('typ turnaje'!$G$24+(+$V$3-$Q113)/'typ turnaje'!$H$24,0),0))","v":""}]
["",113,{"$f":"IF(E114=0,\"\",VLOOKUP($E114,seznam!$A$2:$F$5009,2,FALSE))","v":""},{"$f":"IF(E114=0,\"\",VLOOKUP($E114,seznam!$A$2:$F$5009,3,FALSE))","v":""},null,{"$f":"IF(E114=0,\"\",VLOOKUP($E114,seznam!$A$2:$F$5009,4,FALSE))","v":""},{"$f":"IF(E114=0,\"\",VLOOKUP($E114,seznam!$A$2:$F$5009,5,FALSE))","v":""},null,null,null,null,null,null,null,null,"","","","","",{"$f":"IF(E114=0,\"\",IF(ROUND('typ turnaje'!$G$24+(+$V$3-$Q114)/'typ turnaje'!$H$24,0)>0,ROUND('typ turnaje'!$G$24+(+$V$3-$Q114)/'typ turnaje'!$H$24,0),0))","v":""}]
["",114,{"$f":"IF(E115=0,\"\",VLOOKUP($E115,seznam!$A$2:$F$5009,2,FALSE))","v":""},{"$f":"IF(E115=0,\"\",VLOOKUP($E115,seznam!$A$2:$F$5009,3,FALSE))","v":""},null,{"$f":"IF(E115=0,\"\",VLOOKUP($E115,seznam!$A$2:$F$5009,4,FALSE))","v":""},{"$f":"IF(E115=0,\"\",VLOOKUP($E115,seznam!$A$2:$F$5009,5,FALSE))","v":""},null,null,null,null,null,null,null,null,"","","","","",{"$f":"IF(E115=0,\"\",IF(ROUND('typ turnaje'!$G$24+(+$V$3-$Q115)/'typ turnaje'!$H$24,0)>0,ROUND('typ turnaje'!$G$24+(+$V$3-$Q115)/'typ turnaje'!$H$24,0),0))","v":""}]
["",115,{"$f":"IF(E116=0,\"\",VLOOKUP($E116,seznam!$A$2:$F$5009,2,FALSE))","v":""},{"$f":"IF(E116=0,\"\",VLOOKUP($E116,seznam!$A$2:$F$5009,3,FALSE))","v":""},null,{"$f":"IF(E116=0,\"\",VLOOKUP($E116,seznam!$A$2:$F$5009,4,FALSE))","v":""},{"$f":"IF(E116=0,\"\",VLOOKUP($E116,seznam!$A$2:$F$5009,5,FALSE))","v":""},null,null,null,null,null,null,null,null,"","","","","",{"$f":"IF(E116=0,\"\",IF(ROUND('typ turnaje'!$G$24+(+$V$3-$Q116)/'typ turnaje'!$H$24,0)>0,ROUND('typ turnaje'!$G$24+(+$V$3-$Q116)/'typ turnaje'!$H$24,0),0))","v":""}]
["",116,{"$f":"IF(E117=0,\"\",VLOOKUP($E117,seznam!$A$2:$F$5009,2,FALSE))","v":""},{"$f":"IF(E117=0,\"\",VLOOKUP($E117,seznam!$A$2:$F$5009,3,FALSE))","v":""},null,{"$f":"IF(E117=0,\"\",VLOOKUP($E117,seznam!$A$2:$F$5009,4,FALSE))","v":""},{"$f":"IF(E117=0,\"\",VLOOKUP($E117,seznam!$A$2:$F$5009,5,FALSE))","v":""},null,null,null,null,null,null,null,null,"","","","","",{"$f":"IF(E117=0,\"\",IF(ROUND('typ turnaje'!$G$24+(+$V$3-$Q117)/'typ turnaje'!$H$24,0)>0,ROUND('typ turnaje'!$G$24+(+$V$3-$Q117)/'typ turnaje'!$H$24,0),0))","v":""}]
["",117,{"$f":"IF(E118=0,\"\",VLOOKUP($E118,seznam!$A$2:$F$5009,2,FALSE))","v":""},{"$f":"IF(E118=0,\"\",VLOOKUP($E118,seznam!$A$2:$F$5009,3,FALSE))","v":""},null,{"$f":"IF(E118=0,\"\",VLOOKUP($E118,seznam!$A$2:$F$5009,4,FALSE))","v":""},{"$f":"IF(E118=0,\"\",VLOOKUP($E118,seznam!$A$2:$F$5009,5,FALSE))","v":""},null,null,null,null,null,null,null,null,"","","","","",{"$f":"IF(E118=0,\"\",IF(ROUND('typ turnaje'!$G$24+(+$V$3-$Q118)/'typ turnaje'!$H$24,0)>0,ROUND('typ turnaje'!$G$24+(+$V$3-$Q118)/'typ turnaje'!$H$24,0),0))","v":""}]
["",118,{"$f":"IF(E119=0,\"\",VLOOKUP($E119,seznam!$A$2:$F$5009,2,FALSE))","v":""},{"$f":"IF(E119=0,\"\",VLOOKUP($E119,seznam!$A$2:$F$5009,3,FALSE))","v":""},null,{"$f":"IF(E119=0,\"\",VLOOKUP($E119,seznam!$A$2:$F$5009,4,FALSE))","v":""},{"$f":"IF(E119=0,\"\",VLOOKUP($E119,seznam!$A$2:$F$5009,5,FALSE))","v":""},null,null,null,null,null,null,null,null,"","","","","",{"$f":"IF(E119=0,\"\",IF(ROUND('typ turnaje'!$G$24+(+$V$3-$Q119)/'typ turnaje'!$H$24,0)>0,ROUND('typ turnaje'!$G$24+(+$V$3-$Q119)/'typ turnaje'!$H$24,0),0))","v":""}]
["",119,{"$f":"IF(E120=0,\"\",VLOOKUP($E120,seznam!$A$2:$F$5009,2,FALSE))","v":""},{"$f":"IF(E120=0,\"\",VLOOKUP($E120,seznam!$A$2:$F$5009,3,FALSE))","v":""},null,{"$f":"IF(E120=0,\"\",VLOOKUP($E120,seznam!$A$2:$F$5009,4,FALSE))","v":""},{"$f":"IF(E120=0,\"\",VLOOKUP($E120,seznam!$A$2:$F$5009,5,FALSE))","v":""},null,null,null,null,null,null,null,null,"","","","","",{"$f":"IF(E120=0,\"\",IF(ROUND('typ turnaje'!$G$24+(+$V$3-$Q120)/'typ turnaje'!$H$24,0)>0,ROUND('typ turnaje'!$G$24+(+$V$3-$Q120)/'typ turnaje'!$H$24,0),0))","v":""}]
["",120,{"$f":"IF(E121=0,\"\",VLOOKUP($E121,seznam!$A$2:$F$5009,2,FALSE))","v":""},{"$f":"IF(E121=0,\"\",VLOOKUP($E121,seznam!$A$2:$F$5009,3,FALSE))","v":""},null,{"$f":"IF(E121=0,\"\",VLOOKUP($E121,seznam!$A$2:$F$5009,4,FALSE))","v":""},{"$f":"IF(E121=0,\"\",VLOOKUP($E121,seznam!$A$2:$F$5009,5,FALSE))","v":""},null,null,null,null,null,null,null,null,"","","","","",{"$f":"IF(E121=0,\"\",IF(ROUND('typ turnaje'!$G$24+(+$V$3-$Q121)/'typ turnaje'!$H$24,0)>0,ROUND('typ turnaje'!$G$24+(+$V$3-$Q121)/'typ turnaje'!$H$24,0),0))","v":""}]
["",121,{"$f":"IF(E122=0,\"\",VLOOKUP($E122,seznam!$A$2:$F$5009,2,FALSE))","v":""},{"$f":"IF(E122=0,\"\",VLOOKUP($E122,seznam!$A$2:$F$5009,3,FALSE))","v":""},null,{"$f":"IF(E122=0,\"\",VLOOKUP($E122,seznam!$A$2:$F$5009,4,FALSE))","v":""},{"$f":"IF(E122=0,\"\",VLOOKUP($E122,seznam!$A$2:$F$5009,5,FALSE))","v":""},null,null,null,null,null,null,null,null,"","","","","",{"$f":"IF(E122=0,\"\",IF(ROUND('typ turnaje'!$G$24+(+$V$3-$Q122)/'typ turnaje'!$H$24,0)>0,ROUND('typ turnaje'!$G$24+(+$V$3-$Q122)/'typ turnaje'!$H$24,0),0))","v":""}]
["",122,{"$f":"IF(E123=0,\"\",VLOOKUP($E123,seznam!$A$2:$F$5009,2,FALSE))","v":""},{"$f":"IF(E123=0,\"\",VLOOKUP($E123,seznam!$A$2:$F$5009,3,FALSE))","v":""},null,{"$f":"IF(E123=0,\"\",VLOOKUP($E123,seznam!$A$2:$F$5009,4,FALSE))","v":""},{"$f":"IF(E123=0,\"\",VLOOKUP($E123,seznam!$A$2:$F$5009,5,FALSE))","v":""},null,null,null,null,null,null,null,null,"","","","","",{"$f":"IF(E123=0,\"\",IF(ROUND('typ turnaje'!$G$24+(+$V$3-$Q123)/'typ turnaje'!$H$24,0)>0,ROUND('typ turnaje'!$G$24+(+$V$3-$Q123)/'typ turnaje'!$H$24,0),0))","v":""}]
["",123,{"$f":"IF(E124=0,\"\",VLOOKUP($E124,seznam!$A$2:$F$5009,2,FALSE))","v":""},{"$f":"IF(E124=0,\"\",VLOOKUP($E124,seznam!$A$2:$F$5009,3,FALSE))","v":""},null,{"$f":"IF(E124=0,\"\",VLOOKUP($E124,seznam!$A$2:$F$5009,4,FALSE))","v":""},{"$f":"IF(E124=0,\"\",VLOOKUP($E124,seznam!$A$2:$F$5009,5,FALSE))","v":""},null,null,null,null,null,null,null,null,"","","","","",{"$f":"IF(E124=0,\"\",IF(ROUND('typ turnaje'!$G$24+(+$V$3-$Q124)/'typ turnaje'!$H$24,0)>0,ROUND('typ turnaje'!$G$24+(+$V$3-$Q124)/'typ turnaje'!$H$24,0),0))","v":""}]
["",124,{"$f":"IF(E125=0,\"\",VLOOKUP($E125,seznam!$A$2:$F$5009,2,FALSE))","v":""},{"$f":"IF(E125=0,\"\",VLOOKUP($E125,seznam!$A$2:$F$5009,3,FALSE))","v":""},null,{"$f":"IF(E125=0,\"\",VLOOKUP($E125,seznam!$A$2:$F$5009,4,FALSE))","v":""},{"$f":"IF(E125=0,\"\",VLOOKUP($E125,seznam!$A$2:$F$5009,5,FALSE))","v":""},null,null,null,null,null,null,null,null,"","","","","",{"$f":"IF(E125=0,\"\",IF(ROUND('typ turnaje'!$G$24+(+$V$3-$Q125)/'typ turnaje'!$H$24,0)>0,ROUND('typ turnaje'!$G$24+(+$V$3-$Q125)/'typ turnaje'!$H$24,0),0))","v":""}]
["",125,{"$f":"IF(E126=0,\"\",VLOOKUP($E126,seznam!$A$2:$F$5009,2,FALSE))","v":""},{"$f":"IF(E126=0,\"\",VLOOKUP($E126,seznam!$A$2:$F$5009,3,FALSE))","v":""},null,{"$f":"IF(E126=0,\"\",VLOOKUP($E126,seznam!$A$2:$F$5009,4,FALSE))","v":""},{"$f":"IF(E126=0,\"\",VLOOKUP($E126,seznam!$A$2:$F$5009,5,FALSE))","v":""},null,null,null,null,null,null,null,null,"","","","","",{"$f":"IF(E126=0,\"\",IF(ROUND('typ turnaje'!$G$24+(+$V$3-$Q126)/'typ turnaje'!$H$24,0)>0,ROUND('typ turnaje'!$G$24+(+$V$3-$Q126)/'typ turnaje'!$H$24,0),0))","v":""}]
["",126,{"$f":"IF(E127=0,\"\",VLOOKUP($E127,seznam!$A$2:$F$5009,2,FALSE))","v":""},{"$f":"IF(E127=0,\"\",VLOOKUP($E127,seznam!$A$2:$F$5009,3,FALSE))","v":""},null,{"$f":"IF(E127=0,\"\",VLOOKUP($E127,seznam!$A$2:$F$5009,4,FALSE))","v":""},{"$f":"IF(E127=0,\"\",VLOOKUP($E127,seznam!$A$2:$F$5009,5,FALSE))","v":""},null,null,null,null,null,null,null,null,"","","","","",{"$f":"IF(E127=0,\"\",IF(ROUND('typ turnaje'!$G$24+(+$V$3-$Q127)/'typ turnaje'!$H$24,0)>0,ROUND('typ turnaje'!$G$24+(+$V$3-$Q127)/'typ turnaje'!$H$24,0),0))","v":""}]
["",127,{"$f":"IF(E128=0,\"\",VLOOKUP($E128,seznam!$A$2:$F$5009,2,FALSE))","v":""},{"$f":"IF(E128=0,\"\",VLOOKUP($E128,seznam!$A$2:$F$5009,3,FALSE))","v":""},null,{"$f":"IF(E128=0,\"\",VLOOKUP($E128,seznam!$A$2:$F$5009,4,FALSE))","v":""},{"$f":"IF(E128=0,\"\",VLOOKUP($E128,seznam!$A$2:$F$5009,5,FALSE))","v":""},null,null,null,null,null,null,null,null,"","","","","",{"$f":"IF(E128=0,\"\",IF(ROUND('typ turnaje'!$G$24+(+$V$3-$Q128)/'typ turnaje'!$H$24,0)>0,ROUND('typ turnaje'!$G$24+(+$V$3-$Q128)/'typ turnaje'!$H$24,0),0))","v":""}]
["",128,{"$f":"IF(E129=0,\"\",VLOOKUP($E129,seznam!$A$2:$F$5009,2,FALSE))","v":""},{"$f":"IF(E129=0,\"\",VLOOKUP($E129,seznam!$A$2:$F$5009,3,FALSE))","v":""},null,{"$f":"IF(E129=0,\"\",VLOOKUP($E129,seznam!$A$2:$F$5009,4,FALSE))","v":""},{"$f":"IF(E129=0,\"\",VLOOKUP($E129,seznam!$A$2:$F$5009,5,FALSE))","v":""},null,null,null,null,null,null,null,null,"","","","","",{"$f":"IF(E129=0,\"\",IF(ROUND('typ turnaje'!$G$24+(+$V$3-$Q129)/'typ turnaje'!$H$24,0)>0,ROUND('typ turnaje'!$G$24+(+$V$3-$Q129)/'typ turnaje'!$H$24,0),0))","v":""}]
["",129,{"$f":"IF(E130=0,\"\",VLOOKUP($E130,seznam!$A$2:$F$5009,2,FALSE))","v":""},{"$f":"IF(E130=0,\"\",VLOOKUP($E130,seznam!$A$2:$F$5009,3,FALSE))","v":""},null,{"$f":"IF(E130=0,\"\",VLOOKUP($E130,seznam!$A$2:$F$5009,4,FALSE))","v":""},{"$f":"IF(E130=0,\"\",VLOOKUP($E130,seznam!$A$2:$F$5009,5,FALSE))","v":""},null,null,null,null,null,null,null,null,{"$f":"IF(E130=0,\"\",SUM(H130:O130))","v":""},{"$f":"IF(E130=0,\"\",+P130/COUNT(H130:O130))","v":""},{"$f":"IF(E130=0,\"\",MAX($H130:$O130)-MIN($H130:$O130))","v":""},{"$f":"IF(E130=0,\"\",LARGE($H130:$O130,2)-SMALL($H130:$O130,2))","v":""},{"$f":"IF(E130=0,\"\",+COUNT(H130:O130))","v":""},{"$f":"IF(E130=0,\"\",IF(ROUND('typ turnaje'!$G$24+(+$V$3-$Q130)/'typ turnaje'!$H$24,0)>0,ROUND('typ turnaje'!$G$24+(+$V$3-$Q130)/'typ turnaje'!$H$24,0),0))","v":""}]
[{"$f":"IF(E131=0,\"\",A130+1)","v":""},130,{"$f":"IF(E131=0,\"\",VLOOKUP($E131,seznam!$A$2:$F$5009,2,FALSE))","v":""},{"$f":"IF(E131=0,\"\",VLOOKUP($E131,seznam!$A$2:$F$5009,3,FALSE))","v":""},null,{"$f":"IF(E131=0,\"\",VLOOKUP($E131,seznam!$A$2:$F$5009,4,FALSE))","v":""},{"$f":"IF(E131=0,\"\",VLOOKUP($E131,seznam!$A$2:$F$5009,5,FALSE))","v":""},null,null,null,null,null,null,null,null,"","","","","",{"$f":"IF(E131=0,\"\",IF(ROUND('typ turnaje'!$G$24+(+$V$3-$Q131)/'typ turnaje'!$H$24,0)>0,ROUND('typ turnaje'!$G$24+(+$V$3-$Q131)/'typ turnaje'!$H$24,0),0))","v":""}]
["",131,{"$f":"IF(E132=0,\"\",VLOOKUP($E132,seznam!$A$2:$F$5009,2,FALSE))","v":""},{"$f":"IF(E132=0,\"\",VLOOKUP($E132,seznam!$A$2:$F$5009,3,FALSE))","v":""},null,{"$f":"IF(E132=0,\"\",VLOOKUP($E132,seznam!$A$2:$F$5009,4,FALSE))","v":""},{"$f":"IF(E132=0,\"\",VLOOKUP($E132,seznam!$A$2:$F$5009,5,FALSE))","v":""},null,null,null,null,null,null,null,null,"","","","","",{"$f":"IF(E132=0,\"\",IF(ROUND('typ turnaje'!$G$24+(+$V$3-$Q132)/'typ turnaje'!$H$24,0)>0,ROUND('typ turnaje'!$G$24+(+$V$3-$Q132)/'typ turnaje'!$H$24,0),0))","v":""}]
["",132,{"$f":"IF(E133=0,\"\",VLOOKUP($E133,seznam!$A$2:$F$5009,2,FALSE))","v":""},{"$f":"IF(E133=0,\"\",VLOOKUP($E133,seznam!$A$2:$F$5009,3,FALSE))","v":""},null,{"$f":"IF(E133=0,\"\",VLOOKUP($E133,seznam!$A$2:$F$5009,4,FALSE))","v":""},{"$f":"IF(E133=0,\"\",VLOOKUP($E133,seznam!$A$2:$F$5009,5,FALSE))","v":""},null,null,null,null,null,null,null,null,"","","","","",{"$f":"IF(E133=0,\"\",IF(ROUND('typ turnaje'!$G$24+(+$V$3-$Q133)/'typ turnaje'!$H$24,0)>0,ROUND('typ turnaje'!$G$24+(+$V$3-$Q133)/'typ turnaje'!$H$24,0),0))","v":""}]
["",133,{"$f":"IF(E134=0,\"\",VLOOKUP($E134,seznam!$A$2:$F$5009,2,FALSE))","v":""},{"$f":"IF(E134=0,\"\",VLOOKUP($E134,seznam!$A$2:$F$5009,3,FALSE))","v":""},null,{"$f":"IF(E134=0,\"\",VLOOKUP($E134,seznam!$A$2:$F$5009,4,FALSE))","v":""},{"$f":"IF(E134=0,\"\",VLOOKUP($E134,seznam!$A$2:$F$5009,5,FALSE))","v":""},null,null,null,null,null,null,null,null,"","","","","",{"$f":"IF(E134=0,\"\",IF(ROUND('typ turnaje'!$G$24+(+$V$3-$Q134)/'typ turnaje'!$H$24,0)>0,ROUND('typ turnaje'!$G$24+(+$V$3-$Q134)/'typ turnaje'!$H$24,0),0))","v":""}]
["",134,{"$f":"IF(E135=0,\"\",VLOOKUP($E135,seznam!$A$2:$F$5009,2,FALSE))","v":""},{"$f":"IF(E135=0,\"\",VLOOKUP($E135,seznam!$A$2:$F$5009,3,FALSE))","v":""},null,{"$f":"IF(E135=0,\"\",VLOOKUP($E135,seznam!$A$2:$F$5009,4,FALSE))","v":""},{"$f":"IF(E135=0,\"\",VLOOKUP($E135,seznam!$A$2:$F$5009,5,FALSE))","v":""},null,null,null,null,null,null,null,null,"","","","","",{"$f":"IF(E135=0,\"\",IF(ROUND('typ turnaje'!$G$24+(+$V$3-$Q135)/'typ turnaje'!$H$24,0)>0,ROUND('typ turnaje'!$G$24+(+$V$3-$Q135)/'typ turnaje'!$H$24,0),0))","v":""}]
["",135,{"$f":"IF(E136=0,\"\",VLOOKUP($E136,seznam!$A$2:$F$5009,2,FALSE))","v":""},{"$f":"IF(E136=0,\"\",VLOOKUP($E136,seznam!$A$2:$F$5009,3,FALSE))","v":""},null,{"$f":"IF(E136=0,\"\",VLOOKUP($E136,seznam!$A$2:$F$5009,4,FALSE))","v":""},{"$f":"IF(E136=0,\"\",VLOOKUP($E136,seznam!$A$2:$F$5009,5,FALSE))","v":""},null,null,null,null,null,null,null,null,"","","","","",{"$f":"IF(E136=0,\"\",IF(ROUND('typ turnaje'!$G$24+(+$V$3-$Q136)/'typ turnaje'!$H$24,0)>0,ROUND('typ turnaje'!$G$24+(+$V$3-$Q136)/'typ turnaje'!$H$24,0),0))","v":""}]
["",136,{"$f":"IF(E137=0,\"\",VLOOKUP($E137,seznam!$A$2:$F$5009,2,FALSE))","v":""},{"$f":"IF(E137=0,\"\",VLOOKUP($E137,seznam!$A$2:$F$5009,3,FALSE))","v":""},null,{"$f":"IF(E137=0,\"\",VLOOKUP($E137,seznam!$A$2:$F$5009,4,FALSE))","v":""},{"$f":"IF(E137=0,\"\",VLOOKUP($E137,seznam!$A$2:$F$5009,5,FALSE))","v":""},null,null,null,null,null,null,null,null,"","","","","",{"$f":"IF(E137=0,\"\",IF(ROUND('typ turnaje'!$G$24+(+$V$3-$Q137)/'typ turnaje'!$H$24,0)>0,ROUND('typ turnaje'!$G$24+(+$V$3-$Q137)/'typ turnaje'!$H$24,0),0))","v":""}]
["",137,{"$f":"IF(E138=0,\"\",VLOOKUP($E138,seznam!$A$2:$F$5009,2,FALSE))","v":""},{"$f":"IF(E138=0,\"\",VLOOKUP($E138,seznam!$A$2:$F$5009,3,FALSE))","v":""},null,{"$f":"IF(E138=0,\"\",VLOOKUP($E138,seznam!$A$2:$F$5009,4,FALSE))","v":""},{"$f":"IF(E138=0,\"\",VLOOKUP($E138,seznam!$A$2:$F$5009,5,FALSE))","v":""},null,null,null,null,null,null,null,null,"","","","","",{"$f":"IF(E138=0,\"\",IF(ROUND('typ turnaje'!$G$24+(+$V$3-$Q138)/'typ turnaje'!$H$24,0)>0,ROUND('typ turnaje'!$G$24+(+$V$3-$Q138)/'typ turnaje'!$H$24,0),0))","v":""}]
["",138,{"$f":"IF(E139=0,\"\",VLOOKUP($E139,seznam!$A$2:$F$5009,2,FALSE))","v":""},{"$f":"IF(E139=0,\"\",VLOOKUP($E139,seznam!$A$2:$F$5009,3,FALSE))","v":""},null,{"$f":"IF(E139=0,\"\",VLOOKUP($E139,seznam!$A$2:$F$5009,4,FALSE))","v":""},{"$f":"IF(E139=0,\"\",VLOOKUP($E139,seznam!$A$2:$F$5009,5,FALSE))","v":""},null,null,null,null,null,null,null,null,"","","","","",{"$f":"IF(E139=0,\"\",IF(ROUND('typ turnaje'!$G$24+(+$V$3-$Q139)/'typ turnaje'!$H$24,0)>0,ROUND('typ turnaje'!$G$24+(+$V$3-$Q139)/'typ turnaje'!$H$24,0),0))","v":""}]
["",139,{"$f":"IF(E140=0,\"\",VLOOKUP($E140,seznam!$A$2:$F$5009,2,FALSE))","v":""},{"$f":"IF(E140=0,\"\",VLOOKUP($E140,seznam!$A$2:$F$5009,3,FALSE))","v":""},null,{"$f":"IF(E140=0,\"\",VLOOKUP($E140,seznam!$A$2:$F$5009,4,FALSE))","v":""},{"$f":"IF(E140=0,\"\",VLOOKUP($E140,seznam!$A$2:$F$5009,5,FALSE))","v":""},null,null,null,null,null,null,null,null,"","","","","",{"$f":"IF(E140=0,\"\",IF(ROUND('typ turnaje'!$G$24+(+$V$3-$Q140)/'typ turnaje'!$H$24,0)>0,ROUND('typ turnaje'!$G$24+(+$V$3-$Q140)/'typ turnaje'!$H$24,0),0))","v":""}]
["",140,{"$f":"IF(E141=0,\"\",VLOOKUP($E141,seznam!$A$2:$F$5009,2,FALSE))","v":""},{"$f":"IF(E141=0,\"\",VLOOKUP($E141,seznam!$A$2:$F$5009,3,FALSE))","v":""},null,{"$f":"IF(E141=0,\"\",VLOOKUP($E141,seznam!$A$2:$F$5009,4,FALSE))","v":""},{"$f":"IF(E141=0,\"\",VLOOKUP($E141,seznam!$A$2:$F$5009,5,FALSE))","v":""},null,null,null,null,null,null,null,null,"","","","","",{"$f":"IF(E141=0,\"\",IF(ROUND('typ turnaje'!$G$24+(+$V$3-$Q141)/'typ turnaje'!$H$24,0)>0,ROUND('typ turnaje'!$G$24+(+$V$3-$Q141)/'typ turnaje'!$H$24,0),0))","v":""}]
["",141,{"$f":"IF(E142=0,\"\",VLOOKUP($E142,seznam!$A$2:$F$5009,2,FALSE))","v":""},{"$f":"IF(E142=0,\"\",VLOOKUP($E142,seznam!$A$2:$F$5009,3,FALSE))","v":""},null,{"$f":"IF(E142=0,\"\",VLOOKUP($E142,seznam!$A$2:$F$5009,4,FALSE))","v":""},{"$f":"IF(E142=0,\"\",VLOOKUP($E142,seznam!$A$2:$F$5009,5,FALSE))","v":""},null,null,null,null,null,null,null,null,"","","","","",{"$f":"IF(E142=0,\"\",IF(ROUND('typ turnaje'!$G$24+(+$V$3-$Q142)/'typ turnaje'!$H$24,0)>0,ROUND('typ turnaje'!$G$24+(+$V$3-$Q142)/'typ turnaje'!$H$24,0),0))","v":""}]
["",142,{"$f":"IF(E143=0,\"\",VLOOKUP($E143,seznam!$A$2:$F$5009,2,FALSE))","v":""},{"$f":"IF(E143=0,\"\",VLOOKUP($E143,seznam!$A$2:$F$5009,3,FALSE))","v":""},null,{"$f":"IF(E143=0,\"\",VLOOKUP($E143,seznam!$A$2:$F$5009,4,FALSE))","v":""},{"$f":"IF(E143=0,\"\",VLOOKUP($E143,seznam!$A$2:$F$5009,5,FALSE))","v":""},null,null,null,null,null,null,null,null,"","","","","",{"$f":"IF(E143=0,\"\",IF(ROUND('typ turnaje'!$G$24+(+$V$3-$Q143)/'typ turnaje'!$H$24,0)>0,ROUND('typ turnaje'!$G$24+(+$V$3-$Q143)/'typ turnaje'!$H$24,0),0))","v":""}]
["",143,{"$f":"IF(E144=0,\"\",VLOOKUP($E144,seznam!$A$2:$F$5009,2,FALSE))","v":""},{"$f":"IF(E144=0,\"\",VLOOKUP($E144,seznam!$A$2:$F$5009,3,FALSE))","v":""},null,{"$f":"IF(E144=0,\"\",VLOOKUP($E144,seznam!$A$2:$F$5009,4,FALSE))","v":""},{"$f":"IF(E144=0,\"\",VLOOKUP($E144,seznam!$A$2:$F$5009,5,FALSE))","v":""},null,null,null,null,null,null,null,null,"","","","","",{"$f":"IF(E144=0,\"\",IF(ROUND('typ turnaje'!$G$24+(+$V$3-$Q144)/'typ turnaje'!$H$24,0)>0,ROUND('typ turnaje'!$G$24+(+$V$3-$Q144)/'typ turnaje'!$H$24,0),0))","v":""}]
["",144,{"$f":"IF(E145=0,\"\",VLOOKUP($E145,seznam!$A$2:$F$5009,2,FALSE))","v":""},{"$f":"IF(E145=0,\"\",VLOOKUP($E145,seznam!$A$2:$F$5009,3,FALSE))","v":""},null,{"$f":"IF(E145=0,\"\",VLOOKUP($E145,seznam!$A$2:$F$5009,4,FALSE))","v":""},{"$f":"IF(E145=0,\"\",VLOOKUP($E145,seznam!$A$2:$F$5009,5,FALSE))","v":""},null,null,null,null,null,null,null,null,"","","","","",{"$f":"IF(E145=0,\"\",IF(ROUND('typ turnaje'!$G$24+(+$V$3-$Q145)/'typ turnaje'!$H$24,0)>0,ROUND('typ turnaje'!$G$24+(+$V$3-$Q145)/'typ turnaje'!$H$24,0),0))","v":""}]
["",145,{"$f":"IF(E146=0,\"\",VLOOKUP($E146,seznam!$A$2:$F$5009,2,FALSE))","v":""},{"$f":"IF(E146=0,\"\",VLOOKUP($E146,seznam!$A$2:$F$5009,3,FALSE))","v":""},null,{"$f":"IF(E146=0,\"\",VLOOKUP($E146,seznam!$A$2:$F$5009,4,FALSE))","v":""},{"$f":"IF(E146=0,\"\",VLOOKUP($E146,seznam!$A$2:$F$5009,5,FALSE))","v":""},null,null,null,null,null,null,null,null,"","","","","",{"$f":"IF(E146=0,\"\",IF(ROUND('typ turnaje'!$G$24+(+$V$3-$Q146)/'typ turnaje'!$H$24,0)>0,ROUND('typ turnaje'!$G$24+(+$V$3-$Q146)/'typ turnaje'!$H$24,0),0))","v":""}]
["",146,{"$f":"IF(E147=0,\"\",VLOOKUP($E147,seznam!$A$2:$F$5009,2,FALSE))","v":""},{"$f":"IF(E147=0,\"\",VLOOKUP($E147,seznam!$A$2:$F$5009,3,FALSE))","v":""},null,{"$f":"IF(E147=0,\"\",VLOOKUP($E147,seznam!$A$2:$F$5009,4,FALSE))","v":""},{"$f":"IF(E147=0,\"\",VLOOKUP($E147,seznam!$A$2:$F$5009,5,FALSE))","v":""},null,null,null,null,null,null,null,null,"","","","","",{"$f":"IF(E147=0,\"\",IF(ROUND('typ turnaje'!$G$24+(+$V$3-$Q147)/'typ turnaje'!$H$24,0)>0,ROUND('typ turnaje'!$G$24+(+$V$3-$Q147)/'typ turnaje'!$H$24,0),0))","v":""}]
["",147,{"$f":"IF(E148=0,\"\",VLOOKUP($E148,seznam!$A$2:$F$5009,2,FALSE))","v":""},{"$f":"IF(E148=0,\"\",VLOOKUP($E148,seznam!$A$2:$F$5009,3,FALSE))","v":""},null,{"$f":"IF(E148=0,\"\",VLOOKUP($E148,seznam!$A$2:$F$5009,4,FALSE))","v":""},{"$f":"IF(E148=0,\"\",VLOOKUP($E148,seznam!$A$2:$F$5009,5,FALSE))","v":""},null,null,null,null,null,null,null,null,"","","","","",{"$f":"IF(E148=0,\"\",IF(ROUND('typ turnaje'!$G$24+(+$V$3-$Q148)/'typ turnaje'!$H$24,0)>0,ROUND('typ turnaje'!$G$24+(+$V$3-$Q148)/'typ turnaje'!$H$24,0),0))","v":""}]
["",148,{"$f":"IF(E149=0,\"\",VLOOKUP($E149,seznam!$A$2:$F$5009,2,FALSE))","v":""},{"$f":"IF(E149=0,\"\",VLOOKUP($E149,seznam!$A$2:$F$5009,3,FALSE))","v":""},null,{"$f":"IF(E149=0,\"\",VLOOKUP($E149,seznam!$A$2:$F$5009,4,FALSE))","v":""},{"$f":"IF(E149=0,\"\",VLOOKUP($E149,seznam!$A$2:$F$5009,5,FALSE))","v":""},null,null,null,null,null,null,null,null,"","","","","",{"$f":"IF(E149=0,\"\",IF(ROUND('typ turnaje'!$G$24+(+$V$3-$Q149)/'typ turnaje'!$H$24,0)>0,ROUND('typ turnaje'!$G$24+(+$V$3-$Q149)/'typ turnaje'!$H$24,0),0))","v":""}]
["",149,{"$f":"IF(E150=0,\"\",VLOOKUP($E150,seznam!$A$2:$F$5009,2,FALSE))","v":""},{"$f":"IF(E150=0,\"\",VLOOKUP($E150,seznam!$A$2:$F$5009,3,FALSE))","v":""},null,{"$f":"IF(E150=0,\"\",VLOOKUP($E150,seznam!$A$2:$F$5009,4,FALSE))","v":""},{"$f":"IF(E150=0,\"\",VLOOKUP($E150,seznam!$A$2:$F$5009,5,FALSE))","v":""},null,null,null,null,null,null,null,null,"","","","","",{"$f":"IF(E150=0,\"\",IF(ROUND('typ turnaje'!$G$24+(+$V$3-$Q150)/'typ turnaje'!$H$24,0)>0,ROUND('typ turnaje'!$G$24+(+$V$3-$Q150)/'typ turnaje'!$H$24,0),0))","v":""}]
["",150,{"$f":"IF(E151=0,\"\",VLOOKUP($E151,seznam!$A$2:$F$5009,2,FALSE))","v":""},{"$f":"IF(E151=0,\"\",VLOOKUP($E151,seznam!$A$2:$F$5009,3,FALSE))","v":""},null,{"$f":"IF(E151=0,\"\",VLOOKUP($E151,seznam!$A$2:$F$5009,4,FALSE))","v":""},{"$f":"IF(E151=0,\"\",VLOOKUP($E151,seznam!$A$2:$F$5009,5,FALSE))","v":""},null,null,null,null,null,null,null,null,"","","","","",{"$f":"IF(E151=0,\"\",IF(ROUND('typ turnaje'!$G$24+(+$V$3-$Q151)/'typ turnaje'!$H$24,0)>0,ROUND('typ turnaje'!$G$24+(+$V$3-$Q151)/'typ turnaje'!$H$24,0),0))","v":""}]
["",151,{"$f":"IF(E152=0,\"\",VLOOKUP($E152,seznam!$A$2:$F$5009,2,FALSE))","v":""},{"$f":"IF(E152=0,\"\",VLOOKUP($E152,seznam!$A$2:$F$5009,3,FALSE))","v":""},null,{"$f":"IF(E152=0,\"\",VLOOKUP($E152,seznam!$A$2:$F$5009,4,FALSE))","v":""},{"$f":"IF(E152=0,\"\",VLOOKUP($E152,seznam!$A$2:$F$5009,5,FALSE))","v":""},null,null,null,null,null,null,null,null,"","","","","",{"$f":"IF(E152=0,\"\",IF(ROUND('typ turnaje'!$G$24+(+$V$3-$Q152)/'typ turnaje'!$H$24,0)>0,ROUND('typ turnaje'!$G$24+(+$V$3-$Q152)/'typ turnaje'!$H$24,0),0))","v":""}]
["",152,{"$f":"IF(E153=0,\"\",VLOOKUP($E153,seznam!$A$2:$F$5009,2,FALSE))","v":""},{"$f":"IF(E153=0,\"\",VLOOKUP($E153,seznam!$A$2:$F$5009,3,FALSE))","v":""},null,{"$f":"IF(E153=0,\"\",VLOOKUP($E153,seznam!$A$2:$F$5009,4,FALSE))","v":""},{"$f":"IF(E153=0,\"\",VLOOKUP($E153,seznam!$A$2:$F$5009,5,FALSE))","v":""},null,null,null,null,null,null,null,null,"","","","","",{"$f":"IF(E153=0,\"\",IF(ROUND('typ turnaje'!$G$24+(+$V$3-$Q153)/'typ turnaje'!$H$24,0)>0,ROUND('typ turnaje'!$G$24+(+$V$3-$Q153)/'typ turnaje'!$H$24,0),0))","v":""}]
["",153,{"$f":"IF(E154=0,\"\",VLOOKUP($E154,seznam!$A$2:$F$5009,2,FALSE))","v":""},{"$f":"IF(E154=0,\"\",VLOOKUP($E154,seznam!$A$2:$F$5009,3,FALSE))","v":""},null,{"$f":"IF(E154=0,\"\",VLOOKUP($E154,seznam!$A$2:$F$5009,4,FALSE))","v":""},{"$f":"IF(E154=0,\"\",VLOOKUP($E154,seznam!$A$2:$F$5009,5,FALSE))","v":""},null,null,null,null,null,null,null,null,"","","","","",{"$f":"IF(E154=0,\"\",IF(ROUND('typ turnaje'!$G$24+(+$V$3-$Q154)/'typ turnaje'!$H$24,0)>0,ROUND('typ turnaje'!$G$24+(+$V$3-$Q154)/'typ turnaje'!$H$24,0),0))","v":""}]
["",154,{"$f":"IF(E155=0,\"\",VLOOKUP($E155,seznam!$A$2:$F$5009,2,FALSE))","v":""},{"$f":"IF(E155=0,\"\",VLOOKUP($E155,seznam!$A$2:$F$5009,3,FALSE))","v":""},null,{"$f":"IF(E155=0,\"\",VLOOKUP($E155,seznam!$A$2:$F$5009,4,FALSE))","v":""},{"$f":"IF(E155=0,\"\",VLOOKUP($E155,seznam!$A$2:$F$5009,5,FALSE))","v":""},null,null,null,null,null,null,null,null,"","","","","",{"$f":"IF(E155=0,\"\",IF(ROUND('typ turnaje'!$G$24+(+$V$3-$Q155)/'typ turnaje'!$H$24,0)>0,ROUND('typ turnaje'!$G$24+(+$V$3-$Q155)/'typ turnaje'!$H$24,0),0))","v":""}]
["",155,{"$f":"IF(E156=0,\"\",VLOOKUP($E156,seznam!$A$2:$F$5009,2,FALSE))","v":""},{"$f":"IF(E156=0,\"\",VLOOKUP($E156,seznam!$A$2:$F$5009,3,FALSE))","v":""},null,{"$f":"IF(E156=0,\"\",VLOOKUP($E156,seznam!$A$2:$F$5009,4,FALSE))","v":""},{"$f":"IF(E156=0,\"\",VLOOKUP($E156,seznam!$A$2:$F$5009,5,FALSE))","v":""},null,null,null,null,null,null,null,null,"","","","","",{"$f":"IF(E156=0,\"\",IF(ROUND('typ turnaje'!$G$24+(+$V$3-$Q156)/'typ turnaje'!$H$24,0)>0,ROUND('typ turnaje'!$G$24+(+$V$3-$Q156)/'typ turnaje'!$H$24,0),0))","v":""}]
["",156,{"$f":"IF(E157=0,\"\",VLOOKUP($E157,seznam!$A$2:$F$5009,2,FALSE))","v":""},{"$f":"IF(E157=0,\"\",VLOOKUP($E157,seznam!$A$2:$F$5009,3,FALSE))","v":""},null,{"$f":"IF(E157=0,\"\",VLOOKUP($E157,seznam!$A$2:$F$5009,4,FALSE))","v":""},{"$f":"IF(E157=0,\"\",VLOOKUP($E157,seznam!$A$2:$F$5009,5,FALSE))","v":""},null,null,null,null,null,null,null,null,"","","","","",{"$f":"IF(E157=0,\"\",IF(ROUND('typ turnaje'!$G$24+(+$V$3-$Q157)/'typ turnaje'!$H$24,0)>0,ROUND('typ turnaje'!$G$24+(+$V$3-$Q157)/'typ turnaje'!$H$24,0),0))","v":""}]
["",157,{"$f":"IF(E158=0,\"\",VLOOKUP($E158,seznam!$A$2:$F$5009,2,FALSE))","v":""},{"$f":"IF(E158=0,\"\",VLOOKUP($E158,seznam!$A$2:$F$5009,3,FALSE))","v":""},null,{"$f":"IF(E158=0,\"\",VLOOKUP($E158,seznam!$A$2:$F$5009,4,FALSE))","v":""},{"$f":"IF(E158=0,\"\",VLOOKUP($E158,seznam!$A$2:$F$5009,5,FALSE))","v":""},null,null,null,null,null,null,null,null,"","","","","",{"$f":"IF(E158=0,\"\",IF(ROUND('typ turnaje'!$G$24+(+$V$3-$Q158)/'typ turnaje'!$H$24,0)>0,ROUND('typ turnaje'!$G$24+(+$V$3-$Q158)/'typ turnaje'!$H$24,0),0))","v":""}]
["",158,{"$f":"IF(E159=0,\"\",VLOOKUP($E159,seznam!$A$2:$F$5009,2,FALSE))","v":""},{"$f":"IF(E159=0,\"\",VLOOKUP($E159,seznam!$A$2:$F$5009,3,FALSE))","v":""},null,{"$f":"IF(E159=0,\"\",VLOOKUP($E159,seznam!$A$2:$F$5009,4,FALSE))","v":""},{"$f":"IF(E159=0,\"\",VLOOKUP($E159,seznam!$A$2:$F$5009,5,FALSE))","v":""},null,null,null,null,null,null,null,null,"","","","","",{"$f":"IF(E159=0,\"\",IF(ROUND('typ turnaje'!$G$24+(+$V$3-$Q159)/'typ turnaje'!$H$24,0)>0,ROUND('typ turnaje'!$G$24+(+$V$3-$Q159)/'typ turnaje'!$H$24,0),0))","v":""}]
["",159,{"$f":"IF(E160=0,\"\",VLOOKUP($E160,seznam!$A$2:$F$5009,2,FALSE))","v":""},{"$f":"IF(E160=0,\"\",VLOOKUP($E160,seznam!$A$2:$F$5009,3,FALSE))","v":""},null,{"$f":"IF(E160=0,\"\",VLOOKUP($E160,seznam!$A$2:$F$5009,4,FALSE))","v":""},{"$f":"IF(E160=0,\"\",VLOOKUP($E160,seznam!$A$2:$F$5009,5,FALSE))","v":""},null,null,null,null,null,null,null,null,"","","","","",{"$f":"IF(E160=0,\"\",IF(ROUND('typ turnaje'!$G$24+(+$V$3-$Q160)/'typ turnaje'!$H$24,0)>0,ROUND('typ turnaje'!$G$24+(+$V$3-$Q160)/'typ turnaje'!$H$24,0),0))","v":""}]
["",160,{"$f":"IF(E161=0,\"\",VLOOKUP($E161,seznam!$A$2:$F$5009,2,FALSE))","v":""},{"$f":"IF(E161=0,\"\",VLOOKUP($E161,seznam!$A$2:$F$5009,3,FALSE))","v":""},null,{"$f":"IF(E161=0,\"\",VLOOKUP($E161,seznam!$A$2:$F$5009,4,FALSE))","v":""},{"$f":"IF(E161=0,\"\",VLOOKUP($E161,seznam!$A$2:$F$5009,5,FALSE))","v":""},null,null,null,null,null,null,null,null,"","","","","",{"$f":"IF(E161=0,\"\",IF(ROUND('typ turnaje'!$G$24+(+$V$3-$Q161)/'typ turnaje'!$H$24,0)>0,ROUND('typ turnaje'!$G$24+(+$V$3-$Q161)/'typ turnaje'!$H$24,0),0))","v":""}]

{"sheet":"Liga-kolo-M","index":5,"n_rows":21,"n_cols":35,"rows_kept":21,"cut":false,"hidden":false,"merged":[[0,2,0,3],[10,9,10,10],[10,21,10,22],[10,33,10,34],[20,21,20,22],[20,9,20,10],[0,4,0,12]]}
[4,".kolo",2,null,"liga smíšených družstev",null,null,null,null,null,null,null,null,"2012 / 2013"]
[]
[null,"1. místo",null,null,null,null,null,null,null,null,null,null,null,"2. místo",null,null,null,null,null,null,null,null,null,null,null,"3. místo"]
[null,"SK GC Frant.Lázně \"A\"","reg",1,2,3,4,5,6,7,8,null,null,"SK GC Frant.Lázně \"B\"","reg",1,2,3,4,5,6,7,8,null,null,"MGC Plzeň","reg",1,2,3,4,5,6,7,8]
[1,"Dočkalová Jana",1689,{"$f":"IF($C5=0,\"\",VLOOKUP($C5,'Absolutní-BODY'!$E$2:$O$161,4,FALSE))","v":25},{"$f":"IF($C5=0,\"\",VLOOKUP($C5,'Absolutní-BODY'!$E$2:$O$161,5,FALSE))","v":28},{"$f":"IF($C5=0,\"\",VLOOKUP($C5,'Absolutní-BODY'!$E$2:$O$161,6,FALSE))","v":24},{"$f":"IF($C5=0,\"\",VLOOKUP($C5,'Absolutní-BODY'!$E$2:$O$161,7,FALSE))","v":23},{"$f":"IF($C5=0,\"\",VLOOKUP($C5,'Absolutní-BODY'!$E$2:$O$161,8,FALSE))","v":0},{"$f":"IF($C5=0,\"\",VLOOKUP($C5,'Absolutní-BODY'!$E$2:$O$161,9,FALSE))","v":0},{"$f":"IF($C5=0,\"\",VLOOKUP($C5,'Absolutní-BODY'!$E$2:$O$161,10,FALSE))","v":0},{"$f":"IF($C5=0,\"\",VLOOKUP($C5,'Absolutní-BODY'!$E$2:$O$161,11,FALSE))","v":0},null,1,{"$f":"IF(O5=0,\"\",VLOOKUP($O5,seznam!$A$1:$E$5058,2,FALSE))","v":"Horáček Vlastislav"},233,{"$f":"IF($O5=0,\"\",VLOOKUP($O5,'Absolutní-BODY'!$E$2:$O$161,4,FALSE))","v":27},{"$f":"IF($O5=0,\"\",VLOOKUP($O5,'Absolutní-BODY'!$E$2:$O$161,5,FALSE))","v":28},{"$f":"IF($O5=0,\"\",VLOOKUP($O5,'Absolutní-BODY'!$E$2:$O$161,6,FALSE))","v":26},{"$f":"IF($O5=0,\"\",VLOOKUP($O5,'Absolutní-BODY'!$E$2:$O$161,7,FALSE))","v":27},{"$f":"IF($O5=0,\"\",VLOOKUP($O5,'Absolutní-BODY'!$E$2:$O$161,8,FALSE))","v":0},{"$f":"IF($O5=0,\"\",VLOOKUP($O5,'Absolutní-BODY'!$E$2:$O$161,9,FALSE))","v":0},{"$f":"IF($O5=0,\"\",VLOOKUP($O5,'Absolutní-BODY'!$E$2:$O$161,10,FALSE))","v":0},{"$f":"IF($O5=0,\"\",VLOOKUP($O5,'Absolutní-BODY'!$E$2:$O$161,11,FALSE))","v":0},null,1,{"$f":"IF(AA5=0,\"\",VLOOKUP($AA5,seznam!$A$1:$E$5058,2,FALSE))","v":"Míka Jiří"},2164,{"$f":"IF($AA5=0,\"\",VLOOKUP($AA5,'Absolutní-BODY'!$E$2:$O$161,4,FALSE))","v":24},{"$f":"IF($AA5=0,\"\",VLOOKUP($AA5,'Absolutní-BODY'!$E$2:$O$161,5,FALSE))","v":26},{"$f":"IF($AA5=0,\"\",VLOOKUP($AA5,'Absolutní-BODY'!$E$2:$O$161,6,FALSE))","v":25},{"$f":"IF($AA5=0,\"\",VLOOKUP($AA5,'Absolutní-BODY'!$E$2:$O$161,7,FALSE))","v":26},{"$f":"IF($AA5=0,\"\",VLOOKUP($AA5,'Absolutní-BODY'!$E$2:$O$161,8,FALSE))","v":0},{"$f":"IF($AA5=0,\"\",VLOOKUP($AA5,'Absolutní-BODY'!$E$2:$O$161,9,FALSE))","v":0},{"$f":"IF($AA5=0,\"\",VLOOKUP($AA5,'Absolutní-BODY'!$E$2:$O$161,10,FALSE))","v":0},{"$f":"IF($AA5=0,\"\",VLOOKUP($AA5,'Absolutní-BODY'!$E$2:$O$161,11,FALSE))","v":0}]
[2,"Dočkalová Dana",1388,{"$f":"IF($C6=0,\"\",VLOOKUP($C6,'Absolutní-BODY'!$E$2:$O$161,4,FALSE))","v":27},{"$f":"IF($C6=0,\"\",VLOOKUP($C6,'Absolutní-BODY'!$E$2:$O$161,5,FALSE))","v":27},{"$f":"IF($C6=0,\"\",VLOOKUP($C6,'Absolutní-BODY'!$E$2:$O$161,6,FALSE))","v":26},{"$f":"IF($C6=0,\"\",VLOOKUP($C6,'Absolutní-BODY'!$E$2:$O$161,7,FALSE))","v":26},{"$f":"IF($C6=0,\"\",VLOOKUP($C6,'Absolutní-BODY'!$E$2:$O$161,8,FALSE))","v":0},{"$f":"IF($C6=0,\"\",VLOOKUP($C6,'Absolutní-BODY'!$E$2:$O$161,9,FALSE))","v":0},{"$f":"IF($C6=0,\"\",VLOOKUP($C6,'Absolutní-BODY'!$E$2:$O$161,10,FALSE))","v":0},{"$f":"IF($C6=0,\"\",VLOOKUP($C6,'Absolutní-BODY'!$E$2:$O$161,11,FALSE))","v":0},null,2,{"$f":"IF(O6=0,\"\",VLOOKUP($O6,seznam!$A$1:$E$5058,2,FALSE))","v":"Beran Robert"},1150,{"$f":"IF($O6=0,\"\",VLOOKUP($O6,'Absolutní-BODY'!$E$2:$O$161,4,FALSE))","v":31},{"$f":"IF($O6=0,\"\",VLOOKUP($O6,'Absolutní-BODY'!$E$2:$O$161,5,FALSE))","v":31},{"$f":"IF($O6=0,\"\",VLOOKUP($O6,'Absolutní-BODY'!$E$2:$O$161,6,FALSE))","v":24},{"$f":"IF($O6=0,\"\",VLOOKUP($O6,'Absolutní-BODY'!$E$2:$O$161,7,FALSE))","v":26},{"$f":"IF($O6=0,\"\",VLOOKUP($O6,'Absolutní-BODY'!$E$2:$O$161,8,FALSE))","v":0},{"$f":"IF($O6=0,\"\",VLOOKUP($O6,'Absolutní-BODY'!$E$2:$O$161,9,FALSE))","v":0},{"$f":"IF($O6=0,\"\",VLOOKUP($O6,'Absolutní-BODY'!$E$2:$O$161,10,FALSE))","v":0},{"$f":"IF($O6=0,\"\",VLOOKUP($O6,'Absolutní-BODY'!$E$2:$O$161,11,FALSE))","v":0},null,2,{"$f":"IF(AA6=0,\"\",VLOOKUP($AA6,seznam!$A$1:$E$5058,2,FALSE))","v":"Moutvička Jaroslav"},2502,{"$f":"IF($AA6=0,\"\",VLOOKUP($AA6,'Absolutní-BODY'!$E$2:$O$161,4,FALSE))","v":28},{"$f":"IF($AA6=0,\"\",VLOOKUP($AA6,'Absolutní-BODY'!$E$2:$O$161,5,FALSE))","v":32},{"$f":"IF($AA6=0,\"\",VLOOKUP($AA6,'Absolutní-BODY'!$E$2:$O$161,6,FALSE))","v":30},{"$f":"IF($AA6=0,\"\",VLOOKUP($AA6,'Absolutní-BODY'!$E$2:$O$161,7,FALSE))","v":27},{"$f":"IF($AA6=0,\"\",VLOOKUP($AA6,'Absolutní-BODY'!$E$2:$O$161,8,FALSE))","v":0},{"$f":"IF($AA6=0,\"\",VLOOKUP($AA6,'Absolutní-BODY'!$E$2:$O$161,9,FALSE))","v":0},{"$f":"IF($AA6=0,\"\",VLOOKUP($AA6,'Absolutní-BODY'!$E$2:$O$161,10,FALSE))","v":0},{"$f":"IF($AA6=0,\"\",VLOOKUP($AA6,'Absolutní-BODY'!$E$2:$O$161,11,FALSE))","v":0}]
[3,"Hála Jan",230,{"$f":"IF($C7=0,\"\",VLOOKUP($C7,'Absolutní-BODY'!$E$2:$O$161,4,FALSE))","v":25},{"$f":"IF($C7=0,\"\",VLOOKUP($C7,'Absolutní-BODY'!$E$2:$O$161,5,FALSE))","v":23},{"$f":"IF($C7=0,\"\",VLOOKUP($C7,'Absolutní-BODY'!$E$2:$O$161,6,FALSE))","v":27},{"$f":"IF($C7=0,\"\",VLOOKUP($C7,'Absolutní-BODY'!$E$2:$O$161,7,FALSE))","v":24},{"$f":"IF($C7=0,\"\",VLOOKUP($C7,'Absolutní-BODY'!$E$2:$O$161,8,FALSE))","v":0},{"$f":"IF($C7=0,\"\",VLOOKUP($C7,'Absolutní-BODY'!$E$2:$O$161,9,FALSE))","v":0},{"$f":"IF($C7=0,\"\",VLOOKUP($C7,'Absolutní-BODY'!$E$2:$O$161,10,FALSE))","v":0},{"$f":"IF($C7=0,\"\",VLOOKUP($C7,'Absolutní-BODY'!$E$2:$O$161,11,FALSE))","v":0},null,3,{"$f":"IF(O7=0,\"\",VLOOKUP($O7,seznam!$A$1:$E$5058,2,FALSE))","v":"Malárik Michal"},3475,{"$f":"IF($O7=0,\"\",VLOOKUP($O7,'Absolutní-BODY'!$E$2:$O$161,4,FALSE))","v":26},{"$f":"IF($O7=0,\"\",VLOOKUP($O7,'Absolutní-BODY'!$E$2:$O$161,5,FALSE))","v":28},{"$f":"IF($O7=0,\"\",VLOOKUP($O7,'Absolutní-BODY'!$E$2:$O$161,6,FALSE))","v":20},{"$f":"IF($O7=0,\"\",VLOOKUP($O7,'Absolutní-BODY'!$E$2:$O$161,7,FALSE))","v":24},{"$f":"IF($O7=0,\"\",VLOOKUP($O7,'Absolutní-BODY'!$E$2:$O$161,8,FALSE))","v":0},{"$f":"IF($O7=0,\"\",VLOOKUP($O7,'Absolutní-BODY'!$E$2:$O$161,9,FALSE))","v":0},{"$f":"IF($O7=0,\"\",VLOOKUP($O7,'Absolutní-BODY'!$E$2:$O$161,10,FALSE))","v":0},{"$f":"IF($O7=0,\"\",VLOOKUP($O7,'Absolutní-BODY'!$E$2:$O$161,11,FALSE))","v":0},null,3,{"$f":"IF(AA7=0,\"\",VLOOKUP($AA7,seznam!$A$1:$E$5058,2,FALSE))","v":"Moutvička Ondřej"},2503,{"$f":"IF($AA7=0,\"\",VLOOKUP($AA7,'Absolutní-BODY'!$E$2:$O$161,4,FALSE))","v":23},{"$f":"IF($AA7=0,\"\",VLOOKUP($AA7,'Absolutní-BODY'!$E$2:$O$161,5,FALSE))","v":23},{"$f":"IF($AA7=0,\"\",VLOOKUP($AA7,'Absolutní-BODY'!$E$2:$O$161,6,FALSE))","v":23},{"$f":"IF($AA7=0,\"\",VLOOKUP($AA7,'Absolutní-BODY'!$E$2:$O$161,7,FALSE))","v":28},{"$f":"IF($AA7=0,\"\",VLOOKUP($AA7,'Absolutní-BODY'!$E$2:$O$161,8,FALSE))","v":0},{"$f":"IF($AA7=0,\"\",VLOOKUP($AA7,'Absolutní-BODY'!$E$2:$O$161,9,FALSE))","v":0},{"$f":"IF($AA7=0,\"\",VLOOKUP($AA7,'Absolutní-BODY'!$E$2:$O$161,10,FALSE))","v":0},{"$f":"IF($AA7=0,\"\",VLOOKUP($AA7,'Absolutní-BODY'!$E$2:$O$161,11,FALSE))","v":0}]
[4,"Bireš Jan",652,{"$f":"IF($C8=0,\"\",VLOOKUP($C8,'Absolutní-BODY'!$E$2:$O$161,4,FALSE))","v":28},{"$f":"IF($C8=0,\"\",VLOOKUP($C8,'Absolutní-BODY'!$E$2:$O$161,5,FALSE))","v":27},{"$f":"IF($C8=0,\"\",VLOOKUP($C8,'Absolutní-BODY'!$E$2:$O$161,6,FALSE))","v":24},{"$f":"IF($C8=0,\"\",VLOOKUP($C8,'Absolutní-BODY'!$E$2:$O$161,7,FALSE))","v":27},{"$f":"IF($C8=0,\"\",VLOOKUP($C8,'Absolutní-BODY'!$E$2:$O$161,8,FALSE))","v":0},{"$f":"IF($C8=0,\"\",VLOOKUP($C8,'Absolutní-BODY'!$E$2:$O$161,9,FALSE))","v":0},{"$f":"IF($C8=0,\"\",VLOOKUP($C8,'Absolutní-BODY'!$E$2:$O$161,10,FALSE))","v":0},{"$f":"IF($C8=0,\"\",VLOOKUP($C8,'Absolutní-BODY'!$E$2:$O$161,11,FALSE))","v":0},null,4,{"$f":"IF(O8=0,\"\",VLOOKUP($O8,seznam!$A$1:$E$5058,2,FALSE))","v":"Dočkal Lubomír ml."},1791,{"$f":"IF($O8=0,\"\",VLOOKUP($O8,'Absolutní-BODY'!$E$2:$O$161,4,FALSE))","v":27},{"$f":"IF($O8=0,\"\",VLOOKUP($O8,'Absolutní-BODY'!$E$2:$O$161,5,FALSE))","v":22},{"$f":"IF($O8=0,\"\",VLOOKUP($O8,'Absolutní-BODY'!$E$2:$O$161,6,FALSE))","v":24},{"$f":"IF($O8=0,\"\",VLOOKUP($O8,'Absolutní-BODY'!$E$2:$O$161,7,FALSE))","v":24},{"$f":"IF($O8=0,\"\",VLOOKUP($O8,'Absolutní-BODY'!$E$2:$O$161,8,FALSE))","v":0},{"$f":"IF($O8=0,\"\",VLOOKUP($O8,'Absolutní-BODY'!$E$2:$O$161,9,FALSE))","v":0},{"$f":"IF($O8=0,\"\",VLOOKUP($O8,'Absolutní-BODY'!$E$2:$O$161,10,FALSE))","v":0},{"$f":"IF($O8=0,\"\",VLOOKUP($O8,'Absolutní-BODY'!$E$2:$O$161,11,FALSE))","v":0},null,4,{"$f":"IF(AA8=0,\"\",VLOOKUP($AA8,seznam!$A$1:$E$5058,2,FALSE))","v":"Benda Lumír"},746,{"$f":"IF($AA8=0,\"\",VLOOKUP($AA8,'Absolutní-BODY'!$E$2:$O$161,4,FALSE))","v":27},{"$f":"IF($AA8=0,\"\",VLOOKUP($AA8,'Absolutní-BODY'!$E$2:$O$161,5,FALSE))","v":22},{"$f":"IF($AA8=0,\"\",VLOOKUP($AA8,'Absolutní-BODY'!$E$2:$O$161,6,FALSE))","v":28},{"$f":"IF($AA8=0,\"\",VLOOKUP($AA8,'Absolutní-BODY'!$E$2:$O$161,7,FALSE))","v":28},{"$f":"IF($AA8=0,\"\",VLOOKUP($AA8,'Absolutní-BODY'!$E$2:$O$161,8,FALSE))","v":0},{"$f":"IF($AA8=0,\"\",VLOOKUP($AA8,'Absolutní-BODY'!$E$2:$O$161,9,FALSE))","v":0},{"$f":"IF($AA8=0,\"\",VLOOKUP($AA8,'Absolutní-BODY'!$E$2:$O$161,10,FALSE))","v":0},{"$f":"IF($AA8=0,\"\",VLOOKUP($AA8,'Absolutní-BODY'!$E$2:$O$161,11,FALSE))","v":0}]
["N","Fiedlerová Jaroslava",1478,0,0,0,0,{"$f":"IF($C9=0,\"\",VLOOKUP($C9,'Absolutní-BODY'!$E$2:$O$161,8,FALSE))","v":0},{"$f":"IF($C9=0,\"\",VLOOKUP($C9,'Absolutní-BODY'!$E$2:$O$161,9,FALSE))","v":0},{"$f":"IF($C9=0,\"\",VLOOKUP($C9,'Absolutní-BODY'!$E$2:$O$161,10,FALSE))","v":0},{"$f":"IF($C9=0,\"\",VLOOKUP($C9,'Absolutní-BODY'!$E$2:$O$161,11,FALSE))","v":0},null,"N",{"$f":"IF(O9=0,\"\",VLOOKUP($O9,seznam!$A$1:$E$5058,2,FALSE))","v":"Birešová Vlasta"},526,0,0,0,0,{"$f":"IF($O9=0,\"\",VLOOKUP($O9,'Absolutní-BODY'!$E$2:$O$161,8,FALSE))","v":0},{"$f":"IF($O9=0,\"\",VLOOKUP($O9,'Absolutní-BODY'!$E$2:$O$161,9,FALSE))","v":0},{"$f":"IF($O9=0,\"\",VLOOKUP($O9,'Absolutní-BODY'!$E$2:$O$161,10,FALSE))","v":0},{"$f":"IF($O9=0,\"\",VLOOKUP($O9,'Absolutní-BODY'!$E$2:$O$161,11,FALSE))","v":0},null,null,{"$f":"IF(AA9=0,\"\",VLOOKUP($AA9,seznam!$A$1:$E$5058,2,FALSE))","v":""},null,{"$f":"IF($AA9=0,\"\",VLOOKUP($AA9,'Absolutní-BODY'!$E$2:$O$161,4,FALSE))","v":""},{"$f":"IF($AA9=0,\"\",VLOOKUP($AA9,'Absolutní-BODY'!$E$2:$O$161,5,FALSE))","v":""},{"$f":"IF($AA9=0,\"\",VLOOKUP($AA9,'Absolutní-BODY'!$E$2:$O$161,6,FALSE))","v":""},{"$f":"IF($AA9=0,\"\",VLOOKUP($AA9,'Absolutní-BODY'!$E$2:$O$161,7,FALSE))","v":""},{"$f":"IF($AA9=0,\"\",VLOOKUP($AA9,'Absolutní-BODY'!$E$2:$O$161,8,FALSE))","v":""},{"$f":"IF($AA9=0,\"\",VLOOKUP($AA9,'Absolutní-BODY'!$E$2:$O$161,9,FALSE))","v":""},{"$f":"IF($AA9=0,\"\",VLOOKUP($AA9,'Absolutní-BODY'!$E$2:$O$161,10,FALSE))","v":""},{"$f":"IF($AA9=0,\"\",VLOOKUP($AA9,'Absolutní-BODY'!$E$2:$O$161,11,FALSE))","v":""}]
[null,null,null,{"$f":"SUM(D5:D9)","v":105},105,101,100,0,0,0,0,null,null,null,null,{"$f":"SUM(P5:P9)","v":111},109,94,101,0,0,0,0,null,null,null,null,{"$f":"SUM(AB5:AB9)","v":102},103,106,109,0,0,0,0]
[null,6,"bodů",null,null,null,null,"celkem  ",null,{"$f":"SUM(D10:K10)","v":411},null,null,null,4,"bodů",null,null,null,null,"celkem  ",null,{"$f":"SUM(P10:W10)","v":415},null,null,null,3,"bodů",null,null,null,null,"celkem  ",null,{"$f":"SUM(AB10:AI10)","v":420}]
[]
[null,"4. místo",null,null,null,null,null,null,null,null,null,null,null,"5. místo"]
[null,"SKDG Chomutov","reg",1,2,3,4,5,6,7,8,null,null,"Variete Jesenice","reg",1,2,3,4,5,6,7,8]
[1,"Mráz Josef",408,{"$f":"IF($C15=0,\"\",VLOOKUP($C15,'Absolutní-BODY'!$E$2:$O$161,4,FALSE))","v":26},{"$f":"IF($C15=0,\"\",VLOOKUP($C15,'Absolutní-BODY'!$E$2:$O$161,5,FALSE))","v":24},{"$f":"IF($C15=0,\"\",VLOOKUP($C15,'Absolutní-BODY'!$E$2:$O$161,6,FALSE))","v":28},{"$f":"IF($C15=0,\"\",VLOOKUP($C15,'Absolutní-BODY'!$E$2:$O$161,7,FALSE))","v":24},{"$f":"IF($C15=0,\"\",VLOOKUP($C15,'Absolutní-BODY'!$E$2:$O$161,8,FALSE))","v":0},{"$f":"IF($C15=0,\"\",VLOOKUP($C15,'Absolutní-BODY'!$E$2:$O$161,9,FALSE))","v":0},{"$f":"IF($C15=0,\"\",VLOOKUP($C15,'Absolutní-BODY'!$E$2:$O$161,10,FALSE))","v":0},{"$f":"IF($C15=0,\"\",VLOOKUP($C15,'Absolutní-BODY'!$E$2:$O$161,11,FALSE))","v":0},null,1,{"$f":"IF(O15=0,\"\",VLOOKUP($O15,seznam!$A$1:$E$5058,2,FALSE))","v":"Gruncl Josef"},1278,{"$f":"IF($O15=0,\"\",VLOOKUP($O15,'Absolutní-BODY'!$E$2:$O$161,4,FALSE))","v":29},{"$f":"IF($O15=0,\"\",VLOOKUP($O15,'Absolutní-BODY'!$E$2:$O$161,5,FALSE))","v":30},{"$f":"IF($O15=0,\"\",VLOOKUP($O15,'Absolutní-BODY'!$E$2:$O$161,6,FALSE))","v":32},{"$f":"IF($O15=0,\"\",VLOOKUP($O15,'Absolutní-BODY'!$E$2:$O$161,7,FALSE))","v":31},{"$f":"IF($O15=0,\"\",VLOOKUP($O15,'Absolutní-BODY'!$E$2:$O$161,8,FALSE))","v":0},{"$f":"IF($O15=0,\"\",VLOOKUP($O15,'Absolutní-BODY'!$E$2:$O$161,9,FALSE))","v":0},{"$f":"IF($O15=0,\"\",VLOOKUP($O15,'Absolutní-BODY'!$E$2:$O$161,10,FALSE))","v":0},{"$f":"IF($O15=0,\"\",VLOOKUP($O15,'Absolutní-BODY'!$E$2:$O$161,11,FALSE))","v":0}]
[2,"Drozda Zdeněk",1324,{"$f":"IF($C16=0,\"\",VLOOKUP($C16,'Absolutní-BODY'!$E$2:$O$161,4,FALSE))","v":25},{"$f":"IF($C16=0,\"\",VLOOKUP($C16,'Absolutní-BODY'!$E$2:$O$161,5,FALSE))","v":26},{"$f":"IF($C16=0,\"\",VLOOKUP($C16,'Absolutní-BODY'!$E$2:$O$161,6,FALSE))","v":30},{"$f":"IF($C16=0,\"\",VLOOKUP($C16,'Absolutní-BODY'!$E$2:$O$161,7,FALSE))","v":28},{"$f":"IF($C16=0,\"\",VLOOKUP($C16,'Absolutní-BODY'!$E$2:$O$161,8,FALSE))","v":0},{"$f":"IF($C16=0,\"\",VLOOKUP($C16,'Absolutní-BODY'!$E$2:$O$161,9,FALSE))","v":0},{"$f":"IF($C16=0,\"\",VLOOKUP($C16,'Absolutní-BODY'!$E$2:$O$161,10,FALSE))","v":0},{"$f":"IF($C16=0,\"\",VLOOKUP($C16,'Absolutní-BODY'!$E$2:$O$161,11,FALSE))","v":0},null,2,{"$f":"IF(O16=0,\"\",VLOOKUP($O16,seznam!$A$1:$E$5058,2,FALSE))","v":"Wenzl Daniel"},712,{"$f":"IF($O16=0,\"\",VLOOKUP($O16,'Absolutní-BODY'!$E$2:$O$161,4,FALSE))","v":28},{"$f":"IF($O16=0,\"\",VLOOKUP($O16,'Absolutní-BODY'!$E$2:$O$161,5,FALSE))","v":33},{"$f":"IF($O16=0,\"\",VLOOKUP($O16,'Absolutní-BODY'!$E$2:$O$161,6,FALSE))","v":34},{"$f":"IF($O16=0,\"\",VLOOKUP($O16,'Absolutní-BODY'!$E$2:$O$161,7,FALSE))","v":29},{"$f":"IF($O16=0,\"\",VLOOKUP($O16,'Absolutní-BODY'!$E$2:$O$161,8,FALSE))","v":0},{"$f":"IF($O16=0,\"\",VLOOKUP($O16,'Absolutní-BODY'!$E$2:$O$161,9,FALSE))","v":0},{"$f":"IF($O16=0,\"\",VLOOKUP($O16,'Absolutní-BODY'!$E$2:$O$161,10,FALSE))","v":0},{"$f":"IF($O16=0,\"\",VLOOKUP($O16,'Absolutní-BODY'!$E$2:$O$161,11,FALSE))","v":0}]
[3,"Pajkov Mitko",2318,{"$f":"IF($C17=0,\"\",VLOOKUP($C17,'Absolutní-BODY'!$E$2:$O$161,4,FALSE))","v":30},{"$f":"IF($C17=0,\"\",VLOOKUP($C17,'Absolutní-BODY'!$E$2:$O$161,5,FALSE))","v":26},{"$f":"IF($C17=0,\"\",VLOOKUP($C17,'Absolutní-BODY'!$E$2:$O$161,6,FALSE))","v":27},{"$f":"IF($C17=0,\"\",VLOOKUP($C17,'Absolutní-BODY'!$E$2:$O$161,7,FALSE))","v":32},{"$f":"IF($C17=0,\"\",VLOOKUP($C17,'Absolutní-BODY'!$E$2:$O$161,8,FALSE))","v":0},{"$f":"IF($C17=0,\"\",VLOOKUP($C17,'Absolutní-BODY'!$E$2:$O$161,9,FALSE))","v":0},{"$f":"IF($C17=0,\"\",VLOOKUP($C17,'Absolutní-BODY'!$E$2:$O$161,10,FALSE))","v":0},{"$f":"IF($C17=0,\"\",VLOOKUP($C17,'Absolutní-BODY'!$E$2:$O$161,11,FALSE))","v":0},null,3,{"$f":"IF(O17=0,\"\",VLOOKUP($O17,seznam!$A$1:$E$5058,2,FALSE))","v":"Brettlová Jana"},2570,{"$f":"IF($O17=0,\"\",VLOOKUP($O17,'Absolutní-BODY'!$E$2:$O$161,4,FALSE))","v":30},{"$f":"IF($O17=0,\"\",VLOOKUP($O17,'Absolutní-BODY'!$E$2:$O$161,5,FALSE))","v":26},{"$f":"IF($O17=0,\"\",VLOOKUP($O17,'Absolutní-BODY'!$E$2:$O$161,6,FALSE))","v":29},{"$f":"IF($O17=0,\"\",VLOOKUP($O17,'Absolutní-BODY'!$E$2:$O$161,7,FALSE))","v":26},{"$f":"IF($O17=0,\"\",VLOOKUP($O17,'Absolutní-BODY'!$E$2:$O$161,8,FALSE))","v":0},{"$f":"IF($O17=0,\"\",VLOOKUP($O17,'Absolutní-BODY'!$E$2:$O$161,9,FALSE))","v":0},{"$f":"IF($O17=0,\"\",VLOOKUP($O17,'Absolutní-BODY'!$E$2:$O$161,10,FALSE))","v":0},{"$f":"IF($O17=0,\"\",VLOOKUP($O17,'Absolutní-BODY'!$E$2:$O$161,11,FALSE))","v":0}]
[4,"Mandák Josef",809,{"$f":"IF($C18=0,\"\",VLOOKUP($C18,'Absolutní-BODY'!$E$2:$O$161,4,FALSE))","v":24},{"$f":"IF($C18=0,\"\",VLOOKUP($C18,'Absolutní-BODY'!$E$2:$O$161,5,FALSE))","v":28},{"$f":"IF($C18=0,\"\",VLOOKUP($C18,'Absolutní-BODY'!$E$2:$O$161,6,FALSE))","v":26},{"$f":"IF($C18=0,\"\",VLOOKUP($C18,'Absolutní-BODY'!$E$2:$O$161,7,FALSE))","v":26},{"$f":"IF($C18=0,\"\",VLOOKUP($C18,'Absolutní-BODY'!$E$2:$O$161,8,FALSE))","v":0},{"$f":"IF($C18=0,\"\",VLOOKUP($C18,'Absolutní-BODY'!$E$2:$O$161,9,FALSE))","v":0},{"$f":"IF($C18=0,\"\",VLOOKUP($C18,'Absolutní-BODY'!$E$2:$O$161,10,FALSE))","v":0},{"$f":"IF($C18=0,\"\",VLOOKUP($C18,'Absolutní-BODY'!$E$2:$O$161,11,FALSE))","v":0},null,4,{"$f":"IF(O18=0,\"\",VLOOKUP($O18,seznam!$A$1:$E$5058,2,FALSE))","v":"Lisa Miroslav st."},433,{"$f":"IF($O18=0,\"\",VLOOKUP($O18,'Absolutní-BODY'!$E$2:$O$161,4,FALSE))","v":27},{"$f":"IF($O18=0,\"\",VLOOKUP($O18,'Absolutní-BODY'!$E$2:$O$161,5,FALSE))","v":28},{"$f":"IF($O18=0,\"\",VLOOKUP($O18,'Absolutní-BODY'!$E$2:$O$161,6,FALSE))","v":27},{"$f":"IF($O18=0,\"\",VLOOKUP($O18,'Absolutní-BODY'!$E$2:$O$161,7,FALSE))","v":26},{"$f":"IF($O18=0,\"\",VLOOKUP($O18,'Absolutní-BODY'!$E$2:$O$161,8,FALSE))","v":0},{"$f":"IF($O18=0,\"\",VLOOKUP($O18,'Absolutní-BODY'!$E$2:$O$161,9,FALSE))","v":0},{"$f":"IF($O18=0,\"\",VLOOKUP($O18,'Absolutní-BODY'!$E$2:$O$161,10,FALSE))","v":0},{"$f":"IF($O18=0,\"\",VLOOKUP($O18,'Absolutní-BODY'!$E$2:$O$161,11,FALSE))","v":0}]
["N","Kubantová Lucie",3011,0,0,0,0,{"$f":"IF($C19=0,\"\",VLOOKUP($C19,'Absolutní-BODY'!$E$2:$O$161,8,FALSE))","v":0},{"$f":"IF($C19=0,\"\",VLOOKUP($C19,'Absolutní-BODY'!$E$2:$O$161,9,FALSE))","v":0},{"$f":"IF($C19=0,\"\",VLOOKUP($C19,'Absolutní-BODY'!$E$2:$O$161,10,FALSE))","v":0},{"$f":"IF($C19=0,\"\",VLOOKUP($C19,'Absolutní-BODY'!$E$2:$O$161,11,FALSE))","v":0},null,"N",{"$f":"IF(O19=0,\"\",VLOOKUP($O19,seznam!$A$1:$E$5058,2,FALSE))","v":"Cimerman Jan"},2396,0,0,0,0,0,0,0,0]
[null,null,null,{"$f":"SUM(D15:D19)","v":105},104,111,110,0,0,0,0,null,null,null,null,{"$f":"SUM(P15:P19)","v":114},117,122,112,0,0,0,0]
[null,2,"bodů",null,null,null,null,"celkem  ",null,{"$f":"SUM(D20:K20)","v":430},null,null,null,1,"bodů",null,null,null,null,"celkem  ",null,{"$f":"SUM(P20:W20)","v":465}]

{"sheet":"Liga-kolo-Z","index":6,"n_rows":28,"n_cols":35,"rows_kept":28,"cut":false,"hidden":true,"merged":[[27,9,27,10],[27,21,27,22],[9,9,9,10],[9,21,9,22],[0,2,0,3],[0,4,0,12],[9,33,9,34],[18,9,18,10],[18,21,18,22],[18,33,18,34]]}
["?",".kolo","?",null,"liga ženských družstev",null,null,null,null,null,null,null,null,"2012 / 2013"]
[]
[null,"1. místo",null,null,null,null,null,null,null,null,null,null,null,"2. místo",null,null,null,null,null,null,null,null,null,null,null,"3. místo"]
[null,null,"reg",1,2,3,4,5,6,7,8,null,null,null,"reg",1,2,3,4,5,6,7,8,null,null,null,"reg",1,2,3,4,5,6,7,8]
[1,{"$f":"IF(C5=0,\"\",VLOOKUP($C5,seznam!$A$1:$E$5058,2,FALSE))","v":""},null,{"$f":"IF($C5=0,\"\",VLOOKUP($C5,'Absolutní-BODY'!$E$2:$O$161,4,FALSE))","v":""},{"$f":"IF($C5=0,\"\",VLOOKUP($C5,'Absolutní-BODY'!$E$2:$O$161,5,FALSE))","v":""},{"$f":"IF($C5=0,\"\",VLOOKUP($C5,'Absolutní-BODY'!$E$2:$O$161,6,FALSE))","v":""},{"$f":"IF($C5=0,\"\",VLOOKUP($C5,'Absolutní-BODY'!$E$2:$O$161,7,FALSE))","v":""},{"$f":"IF($C5=0,\"\",VLOOKUP($C5,'Absolutní-BODY'!$E$2:$O$161,8,FALSE))","v":""},{"$f":"IF($C5=0,\"\",VLOOKUP($C5,'Absolutní-BODY'!$E$2:$O$161,9,FALSE))","v":""},{"$f":"IF($C5=0,\"\",VLOOKUP($C5,'Absolutní-BODY'!$E$2:$O$161,10,FALSE))","v":""},{"$f":"IF($C5=0,\"\",VLOOKUP($C5,'Absolutní-BODY'!$E$2:$O$161,11,FALSE))","v":""},null,1,{"$f":"IF(O5=0,\"\",VLOOKUP($O5,seznam!$A$1:$E$5058,2,FALSE))","v":""},null,{"$f":"IF($O5=0,\"\",VLOOKUP($O5,'Absolutní-BODY'!$E$2:$O$161,4,FALSE))","v":""},{"$f":"IF($O5=0,\"\",VLOOKUP($O5,'Absolutní-BODY'!$E$2:$O$161,5,FALSE))","v":""},{"$f":"IF($O5=0,\"\",VLOOKUP($O5,'Absolutní-BODY'!$E$2:$O$161,6,FALSE))","v":""},{"$f":"IF($O5=0,\"\",VLOOKUP($O5,'Absolutní-BODY'!$E$2:$O$161,7,FALSE))","v":""},{"$f":"IF($O5=0,\"\",VLOOKUP($O5,'Absolutní-BODY'!$E$2:$O$161,8,FALSE))","v":""},{"$f":"IF($O5=0,\"\",VLOOKUP($O5,'Absolutní-BODY'!$E$2:$O$161,9,FALSE))","v":""},{"$f":"IF($O5=0,\"\",VLOOKUP($O5,'Absolutní-BODY'!$E$2:$O$161,10,FALSE))","v":""},{"$f":"IF($O5=0,\"\",VLOOKUP($O5,'Absolutní-BODY'!$E$2:$O$161,11,FALSE))","v":""},null,1,{"$f":"IF(AA5=0,\"\",VLOOKUP($AA5,seznam!$A$1:$E$5058,2,FALSE))","v":""},null,{"$f":"IF($AA5=0,\"\",VLOOKUP($AA5,'Absolutní-BODY'!$E$2:$O$161,4,FALSE))","v":""},{"$f":"IF($AA5=0,\"\",VLOOKUP($AA5,'Absolutní-BODY'!$E$2:$O$161,5,FALSE))","v":""},{"$f":"IF($AA5=0,\"\",VLOOKUP($AA5,'Absolutní-BODY'!$E$2:$O$161,6,FALSE))","v":""},{"$f":"IF($AA5=0,\"\",VLOOKUP($AA5,'Absolutní-BODY'!$E$2:$O$161,7,FALSE))","v":""},{"$f":"IF($AA5=0,\"\",VLOOKUP($AA5,'Absolutní-BODY'!$E$2:$O$161,8,FALSE))","v":""},{"$f":"IF($AA5=0,\"\",VLOOKUP($AA5,'Absolutní-BODY'!$E$2:$O$161,9,FALSE))","v":""},{"$f":"IF($AA5=0,\"\",VLOOKUP($AA5,'Absolutní-BODY'!$E$2:$O$161,10,FALSE))","v":""},{"$f":"IF($AA5=0,\"\",VLOOKUP($AA5,'Absolutní-BODY'!$E$2:$O$161,11,FALSE))","v":""}]
[2,{"$f":"IF(C6=0,\"\",VLOOKUP($C6,seznam!$A$1:$E$5058,2,FALSE))","v":""},null,{"$f":"IF($C6=0,\"\",VLOOKUP($C6,'Absolutní-BODY'!$E$2:$O$161,4,FALSE))","v":""},{"$f":"IF($C6=0,\"\",VLOOKUP($C6,'Absolutní-BODY'!$E$2:$O$161,5,FALSE))","v":""},{"$f":"IF($C6=0,\"\",VLOOKUP($C6,'Absolutní-BODY'!$E$2:$O$161,6,FALSE))","v":""},{"$f":"IF($C6=0,\"\",VLOOKUP($C6,'Absolutní-BODY'!$E$2:$O$161,7,FALSE))","v":""},{"$f":"IF($C6=0,\"\",VLOOKUP($C6,'Absolutní-BODY'!$E$2:$O$161,8,FALSE))","v":""},{"$f":"IF($C6=0,\"\",VLOOKUP($C6,'Absolutní-BODY'!$E$2:$O$161,9,FALSE))","v":""},{"$f":"IF($C6=0,\"\",VLOOKUP($C6,'Absolutní-BODY'!$E$2:$O$161,10,FALSE))","v":""},{"$f":"IF($C6=0,\"\",VLOOKUP($C6,'Absolutní-BODY'!$E$2:$O$161,11,FALSE))","v":""},null,2,{"$f":"IF(O6=0,\"\",VLOOKUP($O6,seznam!$A$1:$E$5058,2,FALSE))","v":""},null,{"$f":"IF($O6=0,\"\",VLOOKUP($O6,'Absolutní-BODY'!$E$2:$O$161,4,FALSE))","v":""},{"$f":"IF($O6=0,\"\",VLOOKUP($O6,'Absolutní-BODY'!$E$2:$O$161,5,FALSE))","v":""},{"$f":"IF($O6=0,\"\",VLOOKUP($O6,'Absolutní-BODY'!$E$2:$O$161,6,FALSE))","v":""},{"$f":"IF($O6=0,\"\",VLOOKUP($O6,'Absolutní-BODY'!$E$2:$O$161,7,FALSE))","v":""},{"$f":"IF($O6=0,\"\",VLOOKUP($O6,'Absolutní-BODY'!$E$2:$O$161,8,FALSE))","v":""},{"$f":"IF($O6=0,\"\",VLOOKUP($O6,'Absolutní-BODY'!$E$2:$O$161,9,FALSE))","v":""},{"$f":"IF($O6=0,\"\",VLOOKUP($O6,'Absolutní-BODY'!$E$2:$O$161,10,FALSE))","v":""},{"$f":"IF($O6=0,\"\",VLOOKUP($O6,'Absolutní-BODY'!$E$2:$O$161,11,FALSE))","v":""},null,2,{"$f":"IF(AA6=0,\"\",VLOOKUP($AA6,seznam!$A$1:$E$5058,2,FALSE))","v":""},null,{"$f":"IF($AA6=0,\"\",VLOOKUP($AA6,'Absolutní-BODY'!$E$2:$O$161,4,FALSE))","v":""},{"$f":"IF($AA6=0,\"\",VLOOKUP($AA6,'Absolutní-BODY'!$E$2:$O$161,5,FALSE))","v":""},{"$f":"IF($AA6=0,\"\",VLOOKUP($AA6,'Absolutní-BODY'!$E$2:$O$161,6,FALSE))","v":""},{"$f":"IF($AA6=0,\"\",VLOOKUP($AA6,'Absolutní-BODY'!$E$2:$O$161,7,FALSE))","v":""},{"$f":"IF($AA6=0,\"\",VLOOKUP($AA6,'Absolutní-BODY'!$E$2:$O$161,8,FALSE))","v":""},{"$f":"IF($AA6=0,\"\",VLOOKUP($AA6,'Absolutní-BODY'!$E$2:$O$161,9,FALSE))","v":""},{"$f":"IF($AA6=0,\"\",VLOOKUP($AA6,'Absolutní-BODY'!$E$2:$O$161,10,FALSE))","v":""},{"$f":"IF($AA6=0,\"\",VLOOKUP($AA6,'Absolutní-BODY'!$E$2:$O$161,11,FALSE))","v":""}]
[3,{"$f":"IF(C7=0,\"\",VLOOKUP($C7,seznam!$A$1:$E$5058,2,FALSE))","v":""},null,{"$f":"IF($C7=0,\"\",VLOOKUP($C7,'Absolutní-BODY'!$E$2:$O$161,4,FALSE))","v":""},{"$f":"IF($C7=0,\"\",VLOOKUP($C7,'Absolutní-BODY'!$E$2:$O$161,5,FALSE))","v":""},{"$f":"IF($C7=0,\"\",VLOOKUP($C7,'Absolutní-BODY'!$E$2:$O$161,6,FALSE))","v":""},{"$f":"IF($C7=0,\"\",VLOOKUP($C7,'Absolutní-BODY'!$E$2:$O$161,7,FALSE))","v":""},{"$f":"IF($C7=0,\"\",VLOOKUP($C7,'Absolutní-BODY'!$E$2:$O$161,8,FALSE))","v":""},{"$f":"IF($C7=0,\"\",VLOOKUP($C7,'Absolutní-BODY'!$E$2:$O$161,9,FALSE))","v":""},{"$f":"IF($C7=0,\"\",VLOOKUP($C7,'Absolutní-BODY'!$E$2:$O$161,10,FALSE))","v":""},{"$f":"IF($C7=0,\"\",VLOOKUP($C7,'Absolutní-BODY'!$E$2:$O$161,11,FALSE))","v":""},null,3,{"$f":"IF(O7=0,\"\",VLOOKUP($O7,seznam!$A$1:$E$5058,2,FALSE))","v":""},null,{"$f":"IF($O7=0,\"\",VLOOKUP($O7,'Absolutní-BODY'!$E$2:$O$161,4,FALSE))","v":""},{"$f":"IF($O7=0,\"\",VLOOKUP($O7,'Absolutní-BODY'!$E$2:$O$161,5,FALSE))","v":""},{"$f":"IF($O7=0,\"\",VLOOKUP($O7,'Absolutní-BODY'!$E$2:$O$161,6,FALSE))","v":""},{"$f":"IF($O7=0,\"\",VLOOKUP($O7,'Absolutní-BODY'!$E$2:$O$161,7,FALSE))","v":""},{"$f":"IF($O7=0,\"\",VLOOKUP($O7,'Absolutní-BODY'!$E$2:$O$161,8,FALSE))","v":""},{"$f":"IF($O7=0,\"\",VLOOKUP($O7,'Absolutní-BODY'!$E$2:$O$161,9,FALSE))","v":""},{"$f":"IF($O7=0,\"\",VLOOKUP($O7,'Absolutní-BODY'!$E$2:$O$161,10,FALSE))","v":""},{"$f":"IF($O7=0,\"\",VLOOKUP($O7,'Absolutní-BODY'!$E$2:$O$161,11,FALSE))","v":""},null,3,{"$f":"IF(AA7=0,\"\",VLOOKUP($AA7,seznam!$A$1:$E$5058,2,FALSE))","v":""},null,{"$f":"IF($AA7=0,\"\",VLOOKUP($AA7,'Absolutní-BODY'!$E$2:$O$161,4,FALSE))","v":""},{"$f":"IF($AA7=0,\"\",VLOOKUP($AA7,'Absolutní-BODY'!$E$2:$O$161,5,FALSE))","v":""},{"$f":"IF($AA7=0,\"\",VLOOKUP($AA7,'Absolutní-BODY'!$E$2:$O$161,6,FALSE))","v":""},{"$f":"IF($AA7=0,\"\",VLOOKUP($AA7,'Absolutní-BODY'!$E$2:$O$161,7,FALSE))","v":""},{"$f":"IF($AA7=0,\"\",VLOOKUP($AA7,'Absolutní-BODY'!$E$2:$O$161,8,FALSE))","v":""},{"$f":"IF($AA7=0,\"\",VLOOKUP($AA7,'Absolutní-BODY'!$E$2:$O$161,9,FALSE))","v":""},{"$f":"IF($AA7=0,\"\",VLOOKUP($AA7,'Absolutní-BODY'!$E$2:$O$161,10,FALSE))","v":""},{"$f":"IF($AA7=0,\"\",VLOOKUP($AA7,'Absolutní-BODY'!$E$2:$O$161,11,FALSE))","v":""}]
["N",{"$f":"IF(C8=0,\"\",VLOOKUP($C8,seznam!$A$1:$E$5058,2,FALSE))","v":""},null,{"$f":"IF($C8=0,\"\",VLOOKUP($C8,'Absolutní-BODY'!$E$2:$O$161,4,FALSE))","v":""},{"$f":"IF($C8=0,\"\",VLOOKUP($C8,'Absolutní-BODY'!$E$2:$O$161,5,FALSE))","v":""},{"$f":"IF($C8=0,\"\",VLOOKUP($C8,'Absolutní-BODY'!$E$2:$O$161,6,FALSE))","v":""},{"$f":"IF($C8=0,\"\",VLOOKUP($C8,'Absolutní-BODY'!$E$2:$O$161,7,FALSE))","v":""},{"$f":"IF($C8=0,\"\",VLOOKUP($C8,'Absolutní-BODY'!$E$2:$O$161,8,FALSE))","v":""},{"$f":"IF($C8=0,\"\",VLOOKUP($C8,'Absolutní-BODY'!$E$2:$O$161,9,FALSE))","v":""},{"$f":"IF($C8=0,\"\",VLOOKUP($C8,'Absolutní-BODY'!$E$2:$O$161,10,FALSE))","v":""},{"$f":"IF($C8=0,\"\",VLOOKUP($C8,'Absolutní-BODY'!$E$2:$O$161,11,FALSE))","v":""},null,"N",{"$f":"IF(O8=0,\"\",VLOOKUP($O8,seznam!$A$1:$E$5058,2,FALSE))","v":""},null,{"$f":"IF($O8=0,\"\",VLOOKUP($O8,'Absolutní-BODY'!$E$2:$O$161,4,FALSE))","v":""},{"$f":"IF($O8=0,\"\",VLOOKUP($O8,'Absolutní-BODY'!$E$2:$O$161,5,FALSE))","v":""},{"$f":"IF($O8=0,\"\",VLOOKUP($O8,'Absolutní-BODY'!$E$2:$O$161,6,FALSE))","v":""},{"$f":"IF($O8=0,\"\",VLOOKUP($O8,'Absolutní-BODY'!$E$2:$O$161,7,FALSE))","v":""},{"$f":"IF($O8=0,\"\",VLOOKUP($O8,'Absolutní-BODY'!$E$2:$O$161,8,FALSE))","v":""},{"$f":"IF($O8=0,\"\",VLOOKUP($O8,'Absolutní-BODY'!$E$2:$O$161,9,FALSE))","v":""},{"$f":"IF($O8=0,\"\",VLOOKUP($O8,'Absolutní-BODY'!$E$2:$O$161,10,FALSE))","v":""},{"$f":"IF($O8=0,\"\",VLOOKUP($O8,'Absolutní-BODY'!$E$2:$O$161,11,FALSE))","v":""},null,"N",{"$f":"IF(AA8=0,\"\",VLOOKUP($AA8,seznam!$A$1:$E$5058,2,FALSE))","v":""},null,{"$f":"IF($AA8=0,\"\",VLOOKUP($AA8,'Absolutní-BODY'!$E$2:$O$161,4,FALSE))","v":""},{"$f":"IF($AA8=0,\"\",VLOOKUP($AA8,'Absolutní-BODY'!$E$2:$O$161,5,FALSE))","v":""},{"$f":"IF($AA8=0,\"\",VLOOKUP($AA8,'Absolutní-BODY'!$E$2:$O$161,6,FALSE))","v":""},{"$f":"IF($AA8=0,\"\",VLOOKUP($AA8,'Absolutní-BODY'!$E$2:$O$161,7,FALSE))","v":""},{"$f":"IF($AA8=0,\"\",VLOOKUP($AA8,'Absolutní-BODY'!$E$2:$O$161,8,FALSE))","v":""},{"$f":"IF($AA8=0,\"\",VLOOKUP($AA8,'Absolutní-BODY'!$E$2:$O$161,9,FALSE))","v":""},{"$f":"IF($AA8=0,\"\",VLOOKUP($AA8,'Absolutní-BODY'!$E$2:$O$161,10,FALSE))","v":""},{"$f":"IF($AA8=0,\"\",VLOOKUP($AA8,'Absolutní-BODY'!$E$2:$O$161,11,FALSE))","v":""}]
[null,null,null,{"$f":"SUM(D5:D8)","v":0},0,0,0,0,0,0,0,null,null,null,null,{"$f":"SUM(P5:P8)","v":0},0,0,0,0,0,0,0,null,null,null,null,{"$f":"SUM(AB5:AB8)","v":0},0,0,0,0,0,0,0]
[null,null,"bodů",null,null,null,null,"celkem  ",null,{"$f":"SUM(D9:K9)","v":0},null,null,null,null,"bodů",null,null,null,null,"celkem  ",null,{"$f":"SUM(P9:W9)","v":0},null,null,null,null,"bodů",null,null,null,null,"celkem  ",null,{"$f":"SUM(AB9:AI9)","v":0}]
[]
[null,"4. místo",null,null,null,null,null,null,null,null,null,null,null,"5. místo",null,null,null,null,null,null,null,null,null,null,null,"6. místo"]
[null,null,"reg",1,2,3,4,5,6,7,8,null,null,null,"reg",1,2,3,4,5,6,7,8,null,null,null,"reg",1,2,3,4,5,6,7,8]
[1,{"$f":"IF(C14=0,\"\",VLOOKUP($C14,seznam!$A$1:$E$5058,2,FALSE))","v":""},null,{"$f":"IF($C14=0,\"\",VLOOKUP($C14,'Absolutní-BODY'!$E$2:$O$161,4,FALSE))","v":""},{"$f":"IF($C14=0,\"\",VLOOKUP($C14,'Absolutní-BODY'!$E$2:$O$161,5,FALSE))","v":""},{"$f":"IF($C14=0,\"\",VLOOKUP($C14,'Absolutní-BODY'!$E$2:$O$161,6,FALSE))","v":""},{"$f":"IF($C14=0,\"\",VLOOKUP($C14,'Absolutní-BODY'!$E$2:$O$161,7,FALSE))","v":""},{"$f":"IF($C14=0,\"\",VLOOKUP($C14,'Absolutní-BODY'!$E$2:$O$161,8,FALSE))","v":""},{"$f":"IF($C14=0,\"\",VLOOKUP($C14,'Absolutní-BODY'!$E$2:$O$161,9,FALSE))","v":""},{"$f":"IF($C14=0,\"\",VLOOKUP($C14,'Absolutní-BODY'!$E$2:$O$161,10,FALSE))","v":""},{"$f":"IF($C14=0,\"\",VLOOKUP($C14,'Absolutní-BODY'!$E$2:$O$161,11,FALSE))","v":""},null,1,{"$f":"IF(O14=0,\"\",VLOOKUP($O14,seznam!$A$1:$E$5058,2,FALSE))","v":""},null,{"$f":"IF($O14=0,\"\",VLOOKUP($O14,'Absolutní-BODY'!$E$2:$O$161,4,FALSE))","v":""},{"$f":"IF($O14=0,\"\",VLOOKUP($O14,'Absolutní-BODY'!$E$2:$O$161,5,FALSE))","v":""},{"$f":"IF($O14=0,\"\",VLOOKUP($O14,'Absolutní-BODY'!$E$2:$O$161,6,FALSE))","v":""},{"$f":"IF($O14=0,\"\",VLOOKUP($O14,'Absolutní-BODY'!$E$2:$O$161,7,FALSE))","v":""},{"$f":"IF($O14=0,\"\",VLOOKUP($O14,'Absolutní-BODY'!$E$2:$O$161,8,FALSE))","v":""},{"$f":"IF($O14=0,\"\",VLOOKUP($O14,'Absolutní-BODY'!$E$2:$O$161,9,FALSE))","v":""},{"$f":"IF($O14=0,\"\",VLOOKUP($O14,'Absolutní-BODY'!$E$2:$O$161,10,FALSE))","v":""},{"$f":"IF($O14=0,\"\",VLOOKUP($O14,'Absolutní-BODY'!$E$2:$O$161,11,FALSE))","v":""},null,1,{"$f":"IF(AA14=0,\"\",VLOOKUP($AA14,seznam!$A$1:$E$5058,2,FALSE))","v":""},null,{"$f":"IF($AA14=0,\"\",VLOOKUP($AA14,'Absolutní-BODY'!$E$2:$O$161,4,FALSE))","v":""},{"$f":"IF($AA14=0,\"\",VLOOKUP($AA14,'Absolutní-BODY'!$E$2:$O$161,5,FALSE))","v":""},{"$f":"IF($AA14=0,\"\",VLOOKUP($AA14,'Absolutní-BODY'!$E$2:$O$161,6,FALSE))","v":""},{"$f":"IF($AA14=0,\"\",VLOOKUP($AA14,'Absolutní-BODY'!$E$2:$O$161,7,FALSE))","v":""},{"$f":"IF($AA14=0,\"\",VLOOKUP($AA14,'Absolutní-BODY'!$E$2:$O$161,8,FALSE))","v":""},{"$f":"IF($AA14=0,\"\",VLOOKUP($AA14,'Absolutní-BODY'!$E$2:$O$161,9,FALSE))","v":""},{"$f":"IF($AA14=0,\"\",VLOOKUP($AA14,'Absolutní-BODY'!$E$2:$O$161,10,FALSE))","v":""},{"$f":"IF($AA14=0,\"\",VLOOKUP($AA14,'Absolutní-BODY'!$E$2:$O$161,11,FALSE))","v":""}]
[2,{"$f":"IF(C15=0,\"\",VLOOKUP($C15,seznam!$A$1:$E$5058,2,FALSE))","v":""},null,{"$f":"IF($C15=0,\"\",VLOOKUP($C15,'Absolutní-BODY'!$E$2:$O$161,4,FALSE))","v":""},{"$f":"IF($C15=0,\"\",VLOOKUP($C15,'Absolutní-BODY'!$E$2:$O$161,5,FALSE))","v":""},{"$f":"IF($C15=0,\"\",VLOOKUP($C15,'Absolutní-BODY'!$E$2:$O$161,6,FALSE))","v":""},{"$f":"IF($C15=0,\"\",VLOOKUP($C15,'Absolutní-BODY'!$E$2:$O$161,7,FALSE))","v":""},{"$f":"IF($C15=0,\"\",VLOOKUP($C15,'Absolutní-BODY'!$E$2:$O$161,8,FALSE))","v":""},{"$f":"IF($C15=0,\"\",VLOOKUP($C15,'Absolutní-BODY'!$E$2:$O$161,9,FALSE))","v":""},{"$f":"IF($C15=0,\"\",VLOOKUP($C15,'Absolutní-BODY'!$E$2:$O$161,10,FALSE))","v":""},{"$f":"IF($C15=0,\"\",VLOOKUP($C15,'Absolutní-BODY'!$E$2:$O$161,11,FALSE))","v":""},null,2,{"$f":"IF(O15=0,\"\",VLOOKUP($O15,seznam!$A$1:$E$5058,2,FALSE))","v":""},null,{"$f":"IF($O15=0,\"\",VLOOKUP($O15,'Absolutní-BODY'!$E$2:$O$161,4,FALSE))","v":""},{"$f":"IF($O15=0,\"\",VLOOKUP($O15,'Absolutní-BODY'!$E$2:$O$161,5,FALSE))","v":""},{"$f":"IF($O15=0,\"\",VLOOKUP($O15,'Absolutní-BODY'!$E$2:$O$161,6,FALSE))","v":""},{"$f":"IF($O15=0,\"\",VLOOKUP($O15,'Absolutní-BODY'!$E$2:$O$161,7,FALSE))","v":""},{"$f":"IF($O15=0,\"\",VLOOKUP($O15,'Absolutní-BODY'!$E$2:$O$161,8,FALSE))","v":""},{"$f":"IF($O15=0,\"\",VLOOKUP($O15,'Absolutní-BODY'!$E$2:$O$161,9,FALSE))","v":""},{"$f":"IF($O15=0,\"\",VLOOKUP($O15,'Absolutní-BODY'!$E$2:$O$161,10,FALSE))","v":""},{"$f":"IF($O15=0,\"\",VLOOKUP($O15,'Absolutní-BODY'!$E$2:$O$161,11,FALSE))","v":""},null,2,{"$f":"IF(AA15=0,\"\",VLOOKUP($AA15,seznam!$A$1:$E$5058,2,FALSE))","v":""},null,{"$f":"IF($AA15=0,\"\",VLOOKUP($AA15,'Absolutní-BODY'!$E$2:$O$161,4,FALSE))","v":""},{"$f":"IF($AA15=0,\"\",VLOOKUP($AA15,'Absolutní-BODY'!$E$2:$O$161,5,FALSE))","v":""},{"$f":"IF($AA15=0,\"\",VLOOKUP($AA15,'Absolutní-BODY'!$E$2:$O$161,6,FALSE))","v":""},{"$f":"IF($AA15=0,\"\",VLOOKUP($AA15,'Absolutní-BODY'!$E$2:$O$161,7,FALSE))","v":""},{"$f":"IF($AA15=0,\"\",VLOOKUP($AA15,'Absolutní-BODY'!$E$2:$O$161,8,FALSE))","v":""},{"$f":"IF($AA15=0,\"\",VLOOKUP($AA15,'Absolutní-BODY'!$E$2:$O$161,9,FALSE))","v":""},{"$f":"IF($AA15=0,\"\",VLOOKUP($AA15,'Absolutní-BODY'!$E$2:$O$161,10,FALSE))","v":""},{"$f":"IF($AA15=0,\"\",VLOOKUP($AA15,'Absolutní-BODY'!$E$2:$O$161,11,FALSE))","v":""}]
[3,{"$f":"IF(C16=0,\"\",VLOOKUP($C16,seznam!$A$1:$E$5058,2,FALSE))","v":""},null,{"$f":"IF($C16=0,\"\",VLOOKUP($C16,'Absolutní-BODY'!$E$2:$O$161,4,FALSE))","v":""},{"$f":"IF($C16=0,\"\",VLOOKUP($C16,'Absolutní-BODY'!$E$2:$O$161,5,FALSE))","v":""},{"$f":"IF($C16=0,\"\",VLOOKUP($C16,'Absolutní-BODY'!$E$2:$O$161,6,FALSE))","v":""},{"$f":"IF($C16=0,\"\",VLOOKUP($C16,'Absolutní-BODY'!$E$2:$O$161,7,FALSE))","v":""},{"$f":"IF($C16=0,\"\",VLOOKUP($C16,'Absolutní-BODY'!$E$2:$O$161,8,FALSE))","v":""},{"$f":"IF($C16=0,\"\",VLOOKUP($C16,'Absolutní-BODY'!$E$2:$O$161,9,FALSE))","v":""},{"$f":"IF($C16=0,\"\",VLOOKUP($C16,'Absolutní-BODY'!$E$2:$O$161,10,FALSE))","v":""},{"$f":"IF($C16=0,\"\",VLOOKUP($C16,'Absolutní-BODY'!$E$2:$O$161,11,FALSE))","v":""},null,3,{"$f":"IF(O16=0,\"\",VLOOKUP($O16,seznam!$A$1:$E$5058,2,FALSE))","v":""},null,{"$f":"IF($O16=0,\"\",VLOOKUP($O16,'Absolutní-BODY'!$E$2:$O$161,4,FALSE))","v":""},{"$f":"IF($O16=0,\"\",VLOOKUP($O16,'Absolutní-BODY'!$E$2:$O$161,5,FALSE))","v":""},{"$f":"IF($O16=0,\"\",VLOOKUP($O16,'Absolutní-BODY'!$E$2:$O$161,6,FALSE))","v":""},{"$f":"IF($O16=0,\"\",VLOOKUP($O16,'Absolutní-BODY'!$E$2:$O$161,7,FALSE))","v":""},{"$f":"IF($O16=0,\"\",VLOOKUP($O16,'Absolutní-BODY'!$E$2:$O$161,8,FALSE))","v":""},{"$f":"IF($O16=0,\"\",VLOOKUP($O16,'Absolutní-BODY'!$E$2:$O$161,9,FALSE))","v":""},{"$f":"IF($O16=0,\"\",VLOOKUP($O16,'Absolutní-BODY'!$E$2:$O$161,10,FALSE))","v":""},{"$f":"IF($O16=0,\"\",VLOOKUP($O16,'Absolutní-BODY'!$E$2:$O$161,11,FALSE))","v":""},null,3,{"$f":"IF(AA16=0,\"\",VLOOKUP($AA16,seznam!$A$1:$E$5058,2,FALSE))","v":""},null,{"$f":"IF($AA16=0,\"\",VLOOKUP($AA16,'Absolutní-BODY'!$E$2:$O$161,4,FALSE))","v":""},{"$f":"IF($AA16=0,\"\",VLOOKUP($AA16,'Absolutní-BODY'!$E$2:$O$161,5,FALSE))","v":""},{"$f":"IF($AA16=0,\"\",VLOOKUP($AA16,'Absolutní-BODY'!$E$2:$O$161,6,FALSE))","v":""},{"$f":"IF($AA16=0,\"\",VLOOKUP($AA16,'Absolutní-BODY'!$E$2:$O$161,7,FALSE))","v":""},{"$f":"IF($AA16=0,\"\",VLOOKUP($AA16,'Absolutní-BODY'!$E$2:$O$161,8,FALSE))","v":""},{"$f":"IF($AA16=0,\"\",VLOOKUP($AA16,'Absolutní-BODY'!$E$2:$O$161,9,FALSE))","v":""},{"$f":"IF($AA16=0,\"\",VLOOKUP($AA16,'Absolutní-BODY'!$E$2:$O$161,10,FALSE))","v":""},{"$f":"IF($AA16=0,\"\",VLOOKUP($AA16,'Absolutní-BODY'!$E$2:$O$161,11,FALSE))","v":""}]
["N",{"$f":"IF(C17=0,\"\",VLOOKUP($C17,seznam!$A$1:$E$5058,2,FALSE))","v":""},null,{"$f":"IF($C17=0,\"\",VLOOKUP($C17,'Absolutní-BODY'!$E$2:$O$161,4,FALSE))","v":""},{"$f":"IF($C17=0,\"\",VLOOKUP($C17,'Absolutní-BODY'!$E$2:$O$161,5,FALSE))","v":""},{"$f":"IF($C17=0,\"\",VLOOKUP($C17,'Absolutní-BODY'!$E$2:$O$161,6,FALSE))","v":""},{"$f":"IF($C17=0,\"\",VLOOKUP($C17,'Absolutní-BODY'!$E$2:$O$161,7,FALSE))","v":""},{"$f":"IF($C17=0,\"\",VLOOKUP($C17,'Absolutní-BODY'!$E$2:$O$161,8,FALSE))","v":""},{"$f":"IF($C17=0,\"\",VLOOKUP($C17,'Absolutní-BODY'!$E$2:$O$161,9,FALSE))","v":""},{"$f":"IF($C17=0,\"\",VLOOKUP($C17,'Absolutní-BODY'!$E$2:$O$161,10,FALSE))","v":""},{"$f":"IF($C17=0,\"\",VLOOKUP($C17,'Absolutní-BODY'!$E$2:$O$161,11,FALSE))","v":""},null,"N",{"$f":"IF(O17=0,\"\",VLOOKUP($O17,seznam!$A$1:$E$5058,2,FALSE))","v":""},null,{"$f":"IF($O17=0,\"\",VLOOKUP($O17,'Absolutní-BODY'!$E$2:$O$161,4,FALSE))","v":""},{"$f":"IF($O17=0,\"\",VLOOKUP($O17,'Absolutní-BODY'!$E$2:$O$161,5,FALSE))","v":""},{"$f":"IF($O17=0,\"\",VLOOKUP($O17,'Absolutní-BODY'!$E$2:$O$161,6,FALSE))","v":""},{"$f":"IF($O17=0,\"\",VLOOKUP($O17,'Absolutní-BODY'!$E$2:$O$161,7,FALSE))","v":""},{"$f":"IF($O17=0,\"\",VLOOKUP($O17,'Absolutní-BODY'!$E$2:$O$161,8,FALSE))","v":""},{"$f":"IF($O17=0,\"\",VLOOKUP($O17,'Absolutní-BODY'!$E$2:$O$161,9,FALSE))","v":""},{"$f":"IF($O17=0,\"\",VLOOKUP($O17,'Absolutní-BODY'!$E$2:$O$161,10,FALSE))","v":""},{"$f":"IF($O17=0,\"\",VLOOKUP($O17,'Absolutní-BODY'!$E$2:$O$161,11,FALSE))","v":""},null,"N",{"$f":"IF(AA17=0,\"\",VLOOKUP($AA17,seznam!$A$1:$E$5058,2,FALSE))","v":""},null,{"$f":"IF($AA17=0,\"\",VLOOKUP($AA17,'Absolutní-BODY'!$E$2:$O$161,4,FALSE))","v":""},{"$f":"IF($AA17=0,\"\",VLOOKUP($AA17,'Absolutní-BODY'!$E$2:$O$161,5,FALSE))","v":""},{"$f":"IF($AA17=0,\"\",VLOOKUP($AA17,'Absolutní-BODY'!$E$2:$O$161,6,FALSE))","v":""},{"$f":"IF($AA17=0,\"\",VLOOKUP($AA17,'Absolutní-BODY'!$E$2:$O$161,7,FALSE))","v":""},{"$f":"IF($AA17=0,\"\",VLOOKUP($AA17,'Absolutní-BODY'!$E$2:$O$161,8,FALSE))","v":""},{"$f":"IF($AA17=0,\"\",VLOOKUP($AA17,'Absolutní-BODY'!$E$2:$O$161,9,FALSE))","v":""},{"$f":"IF($AA17=0,\"\",VLOOKUP($AA17,'Absolutní-BODY'!$E$2:$O$161,10,FALSE))","v":""},{"$f":"IF($AA17=0,\"\",VLOOKUP($AA17,'Absolutní-BODY'!$E$2:$O$161,11,FALSE))","v":""}]
[null,null,null,{"$f":"SUM(D14:D17)","v":0},0,0,0,0,0,0,0,null,null,null,null,{"$f":"SUM(P14:P17)","v":0},0,0,0,0,0,0,0,null,null,null,null,{"$f":"SUM(AB14:AB17)","v":0},0,0,0,0,0,0,0]
[null,null,"bodů",null,null,null,null,"celkem  ",null,{"$f":"SUM(D18:K18)","v":0},null,null,null,null,"bodů",null,null,null,null,"celkem  ",null,{"$f":"SUM(P18:W18)","v":0},null,null,null,null,"bodů",null,null,null,null,"celkem  ",null,{"$f":"SUM(AB18:AI18)","v":0}]
[]
[null,"7. místo",null,null,null,null,null,null,null,null,null,null,null,"8. místo"]
[null,null,"reg",1,2,3,4,5,6,7,8,null,null,null,"reg",1,2,3,4,5,6,7,8]
[1,{"$f":"IF(C23=0,\"\",VLOOKUP($C23,seznam!$A$1:$E$5058,2,FALSE))","v":""},null,{"$f":"IF($C23=0,\"\",VLOOKUP($C23,'Absolutní-BODY'!$E$2:$O$161,4,FALSE))","v":""},{"$f":"IF($C23=0,\"\",VLOOKUP($C23,'Absolutní-BODY'!$E$2:$O$161,5,FALSE))","v":""},{"$f":"IF($C23=0,\"\",VLOOKUP($C23,'Absolutní-BODY'!$E$2:$O$161,6,FALSE))","v":""},{"$f":"IF($C23=0,\"\",VLOOKUP($C23,'Absolutní-BODY'!$E$2:$O$161,7,FALSE))","v":""},{"$f":"IF($C23=0,\"\",VLOOKUP($C23,'Absolutní-BODY'!$E$2:$O$161,8,FALSE))","v":""},{"$f":"IF($C23=0,\"\",VLOOKUP($C23,'Absolutní-BODY'!$E$2:$O$161,9,FALSE))","v":""},{"$f":"IF($C23=0,\"\",VLOOKUP($C23,'Absolutní-BODY'!$E$2:$O$161,10,FALSE))","v":""},{"$f":"IF($C23=0,\"\",VLOOKUP($C23,'Absolutní-BODY'!$E$2:$O$161,11,FALSE))","v":""},null,1,{"$f":"IF(O23=0,\"\",VLOOKUP($O23,seznam!$A$1:$E$5058,2,FALSE))","v":""},null,{"$f":"IF($O23=0,\"\",VLOOKUP($O23,'Absolutní-BODY'!$E$2:$O$161,4,FALSE))","v":""},{"$f":"IF($O23=0,\"\",VLOOKUP($O23,'Absolutní-BODY'!$E$2:$O$161,5,FALSE))","v":""},{"$f":"IF($O23=0,\"\",VLOOKUP($O23,'Absolutní-BODY'!$E$2:$O$161,6,FALSE))","v":""},{"$f":"IF($O23=0,\"\",VLOOKUP($O23,'Absolutní-BODY'!$E$2:$O$161,7,FALSE))","v":""},{"$f":"IF($O23=0,\"\",VLOOKUP($O23,'Absolutní-BODY'!$E$2:$O$161,8,FALSE))","v":""},{"$f":"IF($O23=0,\"\",VLOOKUP($O23,'Absolutní-BODY'!$E$2:$O$161,9,FALSE))","v":""},{"$f":"IF($O23=0,\"\",VLOOKUP($O23,'Absolutní-BODY'!$E$2:$O$161,10,FALSE))","v":""},{"$f":"IF($O23=0,\"\",VLOOKUP($O23,'Absolutní-BODY'!$E$2:$O$161,11,FALSE))","v":""}]
[2,{"$f":"IF(C24=0,\"\",VLOOKUP($C24,seznam!$A$1:$E$5058,2,FALSE))","v":""},null,{"$f":"IF($C24=0,\"\",VLOOKUP($C24,'Absolutní-BODY'!$E$2:$O$161,4,FALSE))","v":""},{"$f":"IF($C24=0,\"\",VLOOKUP($C24,'Absolutní-BODY'!$E$2:$O$161,5,FALSE))","v":""},{"$f":"IF($C24=0,\"\",VLOOKUP($C24,'Absolutní-BODY'!$E$2:$O$161,6,FALSE))","v":""},{"$f":"IF($C24=0,\"\",VLOOKUP($C24,'Absolutní-BODY'!$E$2:$O$161,7,FALSE))","v":""},{"$f":"IF($C24=0,\"\",VLOOKUP($C24,'Absolutní-BODY'!$E$2:$O$161,8,FALSE))","v":""},{"$f":"IF($C24=0,\"\",VLOOKUP($C24,'Absolutní-BODY'!$E$2:$O$161,9,FALSE))","v":""},{"$f":"IF($C24=0,\"\",VLOOKUP($C24,'Absolutní-BODY'!$E$2:$O$161,10,FALSE))","v":""},{"$f":"IF($C24=0,\"\",VLOOKUP($C24,'Absolutní-BODY'!$E$2:$O$161,11,FALSE))","v":""},null,2,{"$f":"IF(O24=0,\"\",VLOOKUP($O24,seznam!$A$1:$E$5058,2,FALSE))","v":""},null,{"$f":"IF($O24=0,\"\",VLOOKUP($O24,'Absolutní-BODY'!$E$2:$O$161,4,FALSE))","v":""},{"$f":"IF($O24=0,\"\",VLOOKUP($O24,'Absolutní-BODY'!$E$2:$O$161,5,FALSE))","v":""},{"$f":"IF($O24=0,\"\",VLOOKUP($O24,'Absolutní-BODY'!$E$2:$O$161,6,FALSE))","v":""},{"$f":"IF($O24=0,\"\",VLOOKUP($O24,'Absolutní-BODY'!$E$2:$O$161,7,FALSE))","v":""},{"$f":"IF($O24=0,\"\",VLOOKUP($O24,'Absolutní-BODY'!$E$2:$O$161,8,FALSE))","v":""},{"$f":"IF($O24=0,\"\",VLOOKUP($O24,'Absolutní-BODY'!$E$2:$O$161,9,FALSE))","v":""},{"$f":"IF($O24=0,\"\",VLOOKUP($O24,'Absolutní-BODY'!$E$2:$O$161,10,FALSE))","v":""},{"$f":"IF($O24=0,\"\",VLOOKUP($O24,'Absolutní-BODY'!$E$2:$O$161,11,FALSE))","v":""}]
[3,{"$f":"IF(C25=0,\"\",VLOOKUP($C25,seznam!$A$1:$E$5058,2,FALSE))","v":""},null,{"$f":"IF($C25=0,\"\",VLOOKUP($C25,'Absolutní-BODY'!$E$2:$O$161,4,FALSE))","v":""},{"$f":"IF($C25=0,\"\",VLOOKUP($C25,'Absolutní-BODY'!$E$2:$O$161,5,FALSE))","v":""},{"$f":"IF($C25=0,\"\",VLOOKUP($C25,'Absolutní-BODY'!$E$2:$O$161,6,FALSE))","v":""},{"$f":"IF($C25=0,\"\",VLOOKUP($C25,'Absolutní-BODY'!$E$2:$O$161,7,FALSE))","v":""},{"$f":"IF($C25=0,\"\",VLOOKUP($C25,'Absolutní-BODY'!$E$2:$O$161,8,FALSE))","v":""},{"$f":"IF($C25=0,\"\",VLOOKUP($C25,'Absolutní-BODY'!$E$2:$O$161,9,FALSE))","v":""},{"$f":"IF($C25=0,\"\",VLOOKUP($C25,'Absolutní-BODY'!$E$2:$O$161,10,FALSE))","v":""},{"$f":"IF($C25=0,\"\",VLOOKUP($C25,'Absolutní-BODY'!$E$2:$O$161,11,FALSE))","v":""},null,3,{"$f":"IF(O25=0,\"\",VLOOKUP($O25,seznam!$A$1:$E$5058,2,FALSE))","v":""},null,{"$f":"IF($O25=0,\"\",VLOOKUP($O25,'Absolutní-BODY'!$E$2:$O$161,4,FALSE))","v":""},{"$f":"IF($O25=0,\"\",VLOOKUP($O25,'Absolutní-BODY'!$E$2:$O$161,5,FALSE))","v":""},{"$f":"IF($O25=0,\"\",VLOOKUP($O25,'Absolutní-BODY'!$E$2:$O$161,6,FALSE))","v":""},{"$f":"IF($O25=0,\"\",VLOOKUP($O25,'Absolutní-BODY'!$E$2:$O$161,7,FALSE))","v":""},{"$f":"IF($O25=0,\"\",VLOOKUP($O25,'Absolutní-BODY'!$E$2:$O$161,8,FALSE))","v":""},{"$f":"IF($O25=0,\"\",VLOOKUP($O25,'Absolutní-BODY'!$E$2:$O$161,9,FALSE))","v":""},{"$f":"IF($O25=0,\"\",VLOOKUP($O25,'Absolutní-BODY'!$E$2:$O$161,10,FALSE))","v":""},{"$f":"IF($O25=0,\"\",VLOOKUP($O25,'Absolutní-BODY'!$E$2:$O$161,11,FALSE))","v":""}]
["N",{"$f":"IF(C26=0,\"\",VLOOKUP($C26,seznam!$A$1:$E$5058,2,FALSE))","v":""},null,{"$f":"IF($C26=0,\"\",VLOOKUP($C26,'Absolutní-BODY'!$E$2:$O$161,4,FALSE))","v":""},{"$f":"IF($C26=0,\"\",VLOOKUP($C26,'Absolutní-BODY'!$E$2:$O$161,5,FALSE))","v":""},{"$f":"IF($C26=0,\"\",VLOOKUP($C26,'Absolutní-BODY'!$E$2:$O$161,6,FALSE))","v":""},{"$f":"IF($C26=0,\"\",VLOOKUP($C26,'Absolutní-BODY'!$E$2:$O$161,7,FALSE))","v":""},{"$f":"IF($C26=0,\"\",VLOOKUP($C26,'Absolutní-BODY'!$E$2:$O$161,8,FALSE))","v":""},{"$f":"IF($C26=0,\"\",VLOOKUP($C26,'Absolutní-BODY'!$E$2:$O$161,9,FALSE))","v":""},{"$f":"IF($C26=0,\"\",VLOOKUP($C26,'Absolutní-BODY'!$E$2:$O$161,10,FALSE))","v":""},{"$f":"IF($C26=0,\"\",VLOOKUP($C26,'Absolutní-BODY'!$E$2:$O$161,11,FALSE))","v":""},null,"N",{"$f":"IF(O26=0,\"\",VLOOKUP($O26,seznam!$A$1:$E$5058,2,FALSE))","v":""},null,{"$f":"IF($O26=0,\"\",VLOOKUP($O26,'Absolutní-BODY'!$E$2:$O$161,4,FALSE))","v":""},{"$f":"IF($O26=0,\"\",VLOOKUP($O26,'Absolutní-BODY'!$E$2:$O$161,5,FALSE))","v":""},{"$f":"IF($O26=0,\"\",VLOOKUP($O26,'Absolutní-BODY'!$E$2:$O$161,6,FALSE))","v":""},{"$f":"IF($O26=0,\"\",VLOOKUP($O26,'Absolutní-BODY'!$E$2:$O$161,7,FALSE))","v":""},{"$f":"IF($O26=0,\"\",VLOOKUP($O26,'Absolutní-BODY'!$E$2:$O$161,8,FALSE))","v":""},{"$f":"IF($O26=0,\"\",VLOOKUP($O26,'Absolutní-BODY'!$E$2:$O$161,9,FALSE))","v":""},{"$f":"IF($O26=0,\"\",VLOOKUP($O26,'Absolutní-BODY'!$E$2:$O$161,10,FALSE))","v":""},{"$f":"IF($O26=0,\"\",VLOOKUP($O26,'Absolutní-BODY'!$E$2:$O$161,11,FALSE))","v":""}]
[null,null,null,{"$f":"SUM(D23:D26)","v":0},0,0,0,0,0,0,0,null,null,null,null,{"$f":"SUM(P23:P26)","v":0},0,0,0,0,0,0,0]
[null,null,"bodů",null,null,null,null,"celkem  ",null,{"$f":"SUM(D27:K27)","v":0},null,null,null,null,"bodů",null,null,null,null,"celkem  ",null,{"$f":"SUM(P27:W27)","v":0}]

{"sheet":"Liga-kolo-S","index":7,"n_rows":37,"n_cols":35,"rows_kept":37,"cut":false,"hidden":true,"merged":[[9,33,9,34],[18,9,18,10],[18,21,18,22],[18,33,18,34],[0,2,0,3],[36,9,36,10],[27,33,27,34],[0,4,0,12],[27,9,27,10],[27,21,27,22],[9,9,9,10],[9,21,9,22]]}
["?",".kolo","?",null,"liga seniorských družstev",null,null,null,null,null,null,null,null,"2012 / 2013"]
[]
[null,"1. místo",null,null,null,null,null,null,null,null,null,null,null,"2. místo",null,null,null,null,null,null,null,null,null,null,null,"3. místo"]
[null,null,"reg",1,2,3,4,5,6,7,8,null,null,null,"reg",1,2,3,4,5,6,7,8,null,null,null,"reg",1,2,3,4,5,6,7,8]
[1,{"$f":"IF(C5=0,\"\",VLOOKUP($C5,seznam!$A$1:$E$5058,2,FALSE))","v":""},null,{"$f":"IF($C5=0,\"\",VLOOKUP($C5,'Absolutní-BODY'!$E$2:$O$161,4,FALSE))","v":""},{"$f":"IF($C5=0,\"\",VLOOKUP($C5,'Absolutní-BODY'!$E$2:$O$161,5,FALSE))","v":""},{"$f":"IF($C5=0,\"\",VLOOKUP($C5,'Absolutní-BODY'!$E$2:$O$161,6,FALSE))","v":""},{"$f":"IF($C5=0,\"\",VLOOKUP($C5,'Absolutní-BODY'!$E$2:$O$161,7,FALSE))","v":""},{"$f":"IF($C5=0,\"\",VLOOKUP($C5,'Absolutní-BODY'!$E$2:$O$161,8,FALSE))","v":""},{"$f":"IF($C5=0,\"\",VLOOKUP($C5,'Absolutní-BODY'!$E$2:$O$161,9,FALSE))","v":""},{"$f":"IF($C5=0,\"\",VLOOKUP($C5,'Absolutní-BODY'!$E$2:$O$161,10,FALSE))","v":""},{"$f":"IF($C5=0,\"\",VLOOKUP($C5,'Absolutní-BODY'!$E$2:$O$161,11,FALSE))","v":""},null,1,{"$f":"IF(O5=0,\"\",VLOOKUP($O5,seznam!$A$1:$E$5058,2,FALSE))","v":""},null,{"$f":"IF($O5=0,\"\",VLOOKUP($O5,'Absolutní-BODY'!$E$2:$O$161,4,FALSE))","v":""},{"$f":"IF($O5=0,\"\",VLOOKUP($O5,'Absolutní-BODY'!$E$2:$O$161,5,FALSE))","v":""},{"$f":"IF($O5=0,\"\",VLOOKUP($O5,'Absolutní-BODY'!$E$2:$O$161,6,FALSE))","v":""},{"$f":"IF($O5=0,\"\",VLOOKUP($O5,'Absolutní-BODY'!$E$2:$O$161,7,FALSE))","v":""},{"$f":"IF($O5=0,\"\",VLOOKUP($O5,'Absolutní-BODY'!$E$2:$O$161,8,FALSE))","v":""},{"$f":"IF($O5=0,\"\",VLOOKUP($O5,'Absolutní-BODY'!$E$2:$O$161,9,FALSE))","v":""},{"$f":"IF($O5=0,\"\",VLOOKUP($O5,'Absolutní-BODY'!$E$2:$O$161,10,FALSE))","v":""},{"$f":"IF($O5=0,\"\",VLOOKUP($O5,'Absolutní-BODY'!$E$2:$O$161,11,FALSE))","v":""},null,1,{"$f":"IF(AA5=0,\"\",VLOOKUP($AA5,seznam!$A$1:$E$5058,2,FALSE))","v":""},null,{"$f":"IF($AA5=0,\"\",VLOOKUP($AA5,'Absolutní-BODY'!$E$2:$O$161,4,FALSE))","v":""},{"$f":"IF($AA5=0,\"\",VLOOKUP($AA5,'Absolutní-BODY'!$E$2:$O$161,5,FALSE))","v":""},{"$f":"IF($AA5=0,\"\",VLOOKUP($AA5,'Absolutní-BODY'!$E$2:$O$161,6,FALSE))","v":""},{"$f":"IF($AA5=0,\"\",VLOOKUP($AA5,'Absolutní-BODY'!$E$2:$O$161,7,FALSE))","v":""},{"$f":"IF($AA5=0,\"\",VLOOKUP($AA5,'Absolutní-BODY'!$E$2:$O$161,8,FALSE))","v":""},{"$f":"IF($AA5=0,\"\",VLOOKUP($AA5,'Absolutní-BODY'!$E$2:$O$161,9,FALSE))","v":""},{"$f":"IF($AA5=0,\"\",VLOOKUP($AA5,'Absolutní-BODY'!$E$2:$O$161,10,FALSE))","v":""},{"$f":"IF($AA5=0,\"\",VLOOKUP($AA5,'Absolutní-BODY'!$E$2:$O$161,11,FALSE))","v":""}]
[2,{"$f":"IF(C6=0,\"\",VLOOKUP($C6,seznam!$A$1:$E$5058,2,FALSE))","v":""},null,{"$f":"IF($C6=0,\"\",VLOOKUP($C6,'Absolutní-BODY'!$E$2:$O$161,4,FALSE))","v":""},{"$f":"IF($C6=0,\"\",VLOOKUP($C6,'Absolutní-BODY'!$E$2:$O$161,5,FALSE))","v":""},{"$f":"IF($C6=0,\"\",VLOOKUP($C6,'Absolutní-BODY'!$E$2:$O$161,6,FALSE))","v":""},{"$f":"IF($C6=0,\"\",VLOOKUP($C6,'Absolutní-BODY'!$E$2:$O$161,7,FALSE))","v":""},{"$f":"IF($C6=0,\"\",VLOOKUP($C6,'Absolutní-BODY'!$E$2:$O$161,8,FALSE))","v":""},{"$f":"IF($C6=0,\"\",VLOOKUP($C6,'Absolutní-BODY'!$E$2:$O$161,9,FALSE))","v":""},{"$f":"IF($C6=0,\"\",VLOOKUP($C6,'Absolutní-BODY'!$E$2:$O$161,10,FALSE))","v":""},{"$f":"IF($C6=0,\"\",VLOOKUP($C6,'Absolutní-BODY'!$E$2:$O$161,11,FALSE))","v":""},null,2,{"$f":"IF(O6=0,\"\",VLOOKUP($O6,seznam!$A$1:$E$5058,2,FALSE))","v":""},null,{"$f":"IF($O6=0,\"\",VLOOKUP($O6,'Absolutní-BODY'!$E$2:$O$161,4,FALSE))","v":""},{"$f":"IF($O6=0,\"\",VLOOKUP($O6,'Absolutní-BODY'!$E$2:$O$161,5,FALSE))","v":""},{"$f":"IF($O6=0,\"\",VLOOKUP($O6,'Absolutní-BODY'!$E$2:$O$161,6,FALSE))","v":""},{"$f":"IF($O6=0,\"\",VLOOKUP($O6,'Absolutní-BODY'!$E$2:$O$161,7,FALSE))","v":""},{"$f":"IF($O6=0,\"\",VLOOKUP($O6,'Absolutní-BODY'!$E$2:$O$161,8,FALSE))","v":""},{"$f":"IF($O6=0,\"\",VLOOKUP($O6,'Absolutní-BODY'!$E$2:$O$161,9,FALSE))","v":""},{"$f":"IF($O6=0,\"\",VLOOKUP($O6,'Absolutní-BODY'!$E$2:$O$161,10,FALSE))","v":""},{"$f":"IF($O6=0,\"\",VLOOKUP($O6,'Absolutní-BODY'!$E$2:$O$161,11,FALSE))","v":""},null,2,{"$f":"IF(AA6=0,\"\",VLOOKUP($AA6,seznam!$A$1:$E$5058,2,FALSE))","v":""},null,{"$f":"IF($AA6=0,\"\",VLOOKUP($AA6,'Absolutní-BODY'!$E$2:$O$161,4,FALSE))","v":""},{"$f":"IF($AA6=0,\"\",VLOOKUP($AA6,'Absolutní-BODY'!$E$2:$O$161,5,FALSE))","v":""},{"$f":"IF($AA6=0,\"\",VLOOKUP($AA6,'Absolutní-BODY'!$E$2:$O$161,6,FALSE))","v":""},{"$f":"IF($AA6=0,\"\",VLOOKUP($AA6,'Absolutní-BODY'!$E$2:$O$161,7,FALSE))","v":""},{"$f":"IF($AA6=0,\"\",VLOOKUP($AA6,'Absolutní-BODY'!$E$2:$O$161,8,FALSE))","v":""},{"$f":"IF($AA6=0,\"\",VLOOKUP($AA6,'Absolutní-BODY'!$E$2:$O$161,9,FALSE))","v":""},{"$f":"IF($AA6=0,\"\",VLOOKUP($AA6,'Absolutní-BODY'!$E$2:$O$161,10,FALSE))","v":""},{"$f":"IF($AA6=0,\"\",VLOOKUP($AA6,'Absolutní-BODY'!$E$2:$O$161,11,FALSE))","v":""}]
[3,{"$f":"IF(C7=0,\"\",VLOOKUP($C7,seznam!$A$1:$E$5058,2,FALSE))","v":""},null,{"$f":"IF($C7=0,\"\",VLOOKUP($C7,'Absolutní-BODY'!$E$2:$O$161,4,FALSE))","v":""},{"$f":"IF($C7=0,\"\",VLOOKUP($C7,'Absolutní-BODY'!$E$2:$O$161,5,FALSE))","v":""},{"$f":"IF($C7=0,\"\",VLOOKUP($C7,'Absolutní-BODY'!$E$2:$O$161,6,FALSE))","v":""},{"$f":"IF($C7=0,\"\",VLOOKUP($C7,'Absolutní-BODY'!$E$2:$O$161,7,FALSE))","v":""},{"$f":"IF($C7=0,\"\",VLOOKUP($C7,'Absolutní-BODY'!$E$2:$O$161,8,FALSE))","v":""},{"$f":"IF($C7=0,\"\",VLOOKUP($C7,'Absolutní-BODY'!$E$2:$O$161,9,FALSE))","v":""},{"$f":"IF($C7=0,\"\",VLOOKUP($C7,'Absolutní-BODY'!$E$2:$O$161,10,FALSE))","v":""},{"$f":"IF($C7=0,\"\",VLOOKUP($C7,'Absolutní-BODY'!$E$2:$O$161,11,FALSE))","v":""},null,3,{"$f":"IF(O7=0,\"\",VLOOKUP($O7,seznam!$A$1:$E$5058,2,FALSE))","v":""},null,{"$f":"IF($O7=0,\"\",VLOOKUP($O7,'Absolutní-BODY'!$E$2:$O$161,4,FALSE))","v":""},{"$f":"IF($O7=0,\"\",VLOOKUP($O7,'Absolutní-BODY'!$E$2:$O$161,5,FALSE))","v":""},{"$f":"IF($O7=0,\"\",VLOOKUP($O7,'Absolutní-BODY'!$E$2:$O$161,6,FALSE))","v":""},{"$f":"IF($O7=0,\"\",VLOOKUP($O7,'Absolutní-BODY'!$E$2:$O$161,7,FALSE))","v":""},{"$f":"IF($O7=0,\"\",VLOOKUP($O7,'Absolutní-BODY'!$E$2:$O$161,8,FALSE))","v":""},{"$f":"IF($O7=0,\"\",VLOOKUP($O7,'Absolutní-BODY'!$E$2:$O$161,9,FALSE))","v":""},{"$f":"IF($O7=0,\"\",VLOOKUP($O7,'Absolutní-BODY'!$E$2:$O$161,10,FALSE))","v":""},{"$f":"IF($O7=0,\"\",VLOOKUP($O7,'Absolutní-BODY'!$E$2:$O$161,11,FALSE))","v":""},null,3,{"$f":"IF(AA7=0,\"\",VLOOKUP($AA7,seznam!$A$1:$E$5058,2,FALSE))","v":""},null,{"$f":"IF($AA7=0,\"\",VLOOKUP($AA7,'Absolutní-BODY'!$E$2:$O$161,4,FALSE))","v":""},{"$f":"IF($AA7=0,\"\",VLOOKUP($AA7,'Absolutní-BODY'!$E$2:$O$161,5,FALSE))","v":""},{"$f":"IF($AA7=0,\"\",VLOOKUP($AA7,'Absolutní-BODY'!$E$2:$O$161,6,FALSE))","v":""},{"$f":"IF($AA7=0,\"\",VLOOKUP($AA7,'Absolutní-BODY'!$E$2:$O$161,7,FALSE))","v":""},{"$f":"IF($AA7=0,\"\",VLOOKUP($AA7,'Absolutní-BODY'!$E$2:$O$161,8,FALSE))","v":""},{"$f":"IF($AA7=0,\"\",VLOOKUP($AA7,'Absolutní-BODY'!$E$2:$O$161,9,FALSE))","v":""},{"$f":"IF($AA7=0,\"\",VLOOKUP($AA7,'Absolutní-BODY'!$E$2:$O$161,10,FALSE))","v":""},{"$f":"IF($AA7=0,\"\",VLOOKUP($AA7,'Absolutní-BODY'!$E$2:$O$161,11,FALSE))","v":""}]
["N",{"$f":"IF(C8=0,\"\",VLOOKUP($C8,seznam!$A$1:$E$5058,2,FALSE))","v":""},null,{"$f":"IF($C8=0,\"\",VLOOKUP($C8,'Absolutní-BODY'!$E$2:$O$161,4,FALSE))","v":""},{"$f":"IF($C8=0,\"\",VLOOKUP($C8,'Absolutní-BODY'!$E$2:$O$161,5,FALSE))","v":""},{"$f":"IF($C8=0,\"\",VLOOKUP($C8,'Absolutní-BODY'!$E$2:$O$161,6,FALSE))","v":""},{"$f":"IF($C8=0,\"\",VLOOKUP($C8,'Absolutní-BODY'!$E$2:$O$161,7,FALSE))","v":""},{"$f":"IF($C8=0,\"\",VLOOKUP($C8,'Absolutní-BODY'!$E$2:$O$161,8,FALSE))","v":""},{"$f":"IF($C8=0,\"\",VLOOKUP($C8,'Absolutní-BODY'!$E$2:$O$161,9,FALSE))","v":""},{"$f":"IF($C8=0,\"\",VLOOKUP($C8,'Absolutní-BODY'!$E$2:$O$161,10,FALSE))","v":""},{"$f":"IF($C8=0,\"\",VLOOKUP($C8,'Absolutní-BODY'!$E$2:$O$161,11,FALSE))","v":""},null,"N",{"$f":"IF(O8=0,\"\",VLOOKUP($O8,seznam!$A$1:$E$5058,2,FALSE))","v":""},null,{"$f":"IF($O8=0,\"\",VLOOKUP($O8,'Absolutní-BODY'!$E$2:$O$161,4,FALSE))","v":""},{"$f":"IF($O8=0,\"\",VLOOKUP($O8,'Absolutní-BODY'!$E$2:$O$161,5,FALSE))","v":""},{"$f":"IF($O8=0,\"\",VLOOKUP($O8,'Absolutní-BODY'!$E$2:$O$161,6,FALSE))","v":""},{"$f":"IF($O8=0,\"\",VLOOKUP($O8,'Absolutní-BODY'!$E$2:$O$161,7,FALSE))","v":""},{"$f":"IF($O8=0,\"\",VLOOKUP($O8,'Absolutní-BODY'!$E$2:$O$161,8,FALSE))","v":""},{"$f":"IF($O8=0,\"\",VLOOKUP($O8,'Absolutní-BODY'!$E$2:$O$161,9,FALSE))","v":""},{"$f":"IF($O8=0,\"\",VLOOKUP($O8,'Absolutní-BODY'!$E$2:$O$161,10,FALSE))","v":""},{"$f":"IF($O8=0,\"\",VLOOKUP($O8,'Absolutní-BODY'!$E$2:$O$161,11,FALSE))","v":""},null,"N",{"$f":"IF(AA8=0,\"\",VLOOKUP($AA8,seznam!$A$1:$E$5058,2,FALSE))","v":""},null,{"$f":"IF($AA8=0,\"\",VLOOKUP($AA8,'Absolutní-BODY'!$E$2:$O$161,4,FALSE))","v":""},{"$f":"IF($AA8=0,\"\",VLOOKUP($AA8,'Absolutní-BODY'!$E$2:$O$161,5,FALSE))","v":""},{"$f":"IF($AA8=0,\"\",VLOOKUP($AA8,'Absolutní-BODY'!$E$2:$O$161,6,FALSE))","v":""},{"$f":"IF($AA8=0,\"\",VLOOKUP($AA8,'Absolutní-BODY'!$E$2:$O$161,7,FALSE))","v":""},{"$f":"IF($AA8=0,\"\",VLOOKUP($AA8,'Absolutní-BODY'!$E$2:$O$161,8,FALSE))","v":""},{"$f":"IF($AA8=0,\"\",VLOOKUP($AA8,'Absolutní-BODY'!$E$2:$O$161,9,FALSE))","v":""},{"$f":"IF($AA8=0,\"\",VLOOKUP($AA8,'Absolutní-BODY'!$E$2:$O$161,10,FALSE))","v":""},{"$f":"IF($AA8=0,\"\",VLOOKUP($AA8,'Absolutní-BODY'!$E$2:$O$161,11,FALSE))","v":""}]
[null,null,null,{"$f":"SUM(D5:D8)","v":0},0,0,0,0,0,0,0,null,null,null,null,{"$f":"SUM(P5:P8)","v":0},0,0,0,0,0,0,0,null,null,null,null,{"$f":"SUM(AB5:AB8)","v":0},0,0,0,0,0,0,0]
[null,null,"bodů",null,null,null,null,"celkem  ",null,{"$f":"SUM(D9:K9)","v":0},null,null,null,null,"bodů",null,null,null,null,"celkem  ",null,{"$f":"SUM(P9:W9)","v":0},null,null,null,null,"bodů",null,null,null,null,"celkem  ",null,{"$f":"SUM(AB9:AI9)","v":0}]
[]
[null,"4. místo",null,null,null,null,null,null,null,null,null,null,null,"5. místo",null,null,null,null,null,null,null,null,null,null,null,"6. místo"]
[null,null,"reg",1,2,3,4,5,6,7,8,null,null,null,"reg",1,2,3,4,5,6,7,8,null,null,null,"reg",1,2,3,4,5,6,7,8]
[1,{"$f":"IF(C14=0,\"\",VLOOKUP($C14,seznam!$A$1:$E$5058,2,FALSE))","v":""},null,{"$f":"IF($C14=0,\"\",VLOOKUP($C14,'Absolutní-BODY'!$E$2:$O$161,4,FALSE))","v":""},{"$f":"IF($C14=0,\"\",VLOOKUP($C14,'Absolutní-BODY'!$E$2:$O$161,5,FALSE))","v":""},{"$f":"IF($C14=0,\"\",VLOOKUP($C14,'Absolutní-BODY'!$E$2:$O$161,6,FALSE))","v":""},{"$f":"IF($C14=0,\"\",VLOOKUP($C14,'Absolutní-BODY'!$E$2:$O$161,7,FALSE))","v":""},{"$f":"IF($C14=0,\"\",VLOOKUP($C14,'Absolutní-BODY'!$E$2:$O$161,8,FALSE))","v":""},{"$f":"IF($C14=0,\"\",VLOOKUP($C14,'Absolutní-BODY'!$E$2:$O$161,9,FALSE))","v":""},{"$f":"IF($C14=0,\"\",VLOOKUP($C14,'Absolutní-BODY'!$E$2:$O$161,10,FALSE))","v":""},{"$f":"IF($C14=0,\"\",VLOOKUP($C14,'Absolutní-BODY'!$E$2:$O$161,11,FALSE))","v":""},null,1,{"$f":"IF(O14=0,\"\",VLOOKUP($O14,seznam!$A$1:$E$5058,2,FALSE))","v":""},null,{"$f":"IF($O14=0,\"\",VLOOKUP($O14,'Absolutní-BODY'!$E$2:$O$161,4,FALSE))","v":""},{"$f":"IF($O14=0,\"\",VLOOKUP($O14,'Absolutní-BODY'!$E$2:$O$161,5,FALSE))","v":""},{"$f":"IF($O14=0,\"\",VLOOKUP($O14,'Absolutní-BODY'!$E$2:$O$161,6,FALSE))","v":""},{"$f":"IF($O14=0,\"\",VLOOKUP($O14,'Absolutní-BODY'!$E$2:$O$161,7,FALSE))","v":""},{"$f":"IF($O14=0,\"\",VLOOKUP($O14,'Absolutní-BODY'!$E$2:$O$161,8,FALSE))","v":""},{"$f":"IF($O14=0,\"\",VLOOKUP($O14,'Absolutní-BODY'!$E$2:$O$161,9,FALSE))","v":""},{"$f":"IF($O14=0,\"\",VLOOKUP($O14,'Absolutní-BODY'!$E$2:$O$161,10,FALSE))","v":""},{"$f":"IF($O14=0,\"\",VLOOKUP($O14,'Absolutní-BODY'!$E$2:$O$161,11,FALSE))","v":""},null,1,{"$f":"IF(AA14=0,\"\",VLOOKUP($AA14,seznam!$A$1:$E$5058,2,FALSE))","v":""},null,{"$f":"IF($AA14=0,\"\",VLOOKUP($AA14,'Absolutní-BODY'!$E$2:$O$161,4,FALSE))","v":""},{"$f":"IF($AA14=0,\"\",VLOOKUP($AA14,'Absolutní-BODY'!$E$2:$O$161,5,FALSE))","v":""},{"$f":"IF($AA14=0,\"\",VLOOKUP($AA14,'Absolutní-BODY'!$E$2:$O$161,6,FALSE))","v":""},{"$f":"IF($AA14=0,\"\",VLOOKUP($AA14,'Absolutní-BODY'!$E$2:$O$161,7,FALSE))","v":""},{"$f":"IF($AA14=0,\"\",VLOOKUP($AA14,'Absolutní-BODY'!$E$2:$O$161,8,FALSE))","v":""},{"$f":"IF($AA14=0,\"\",VLOOKUP($AA14,'Absolutní-BODY'!$E$2:$O$161,9,FALSE))","v":""},{"$f":"IF($AA14=0,\"\",VLOOKUP($AA14,'Absolutní-BODY'!$E$2:$O$161,10,FALSE))","v":""},{"$f":"IF($AA14=0,\"\",VLOOKUP($AA14,'Absolutní-BODY'!$E$2:$O$161,11,FALSE))","v":""}]
[2,{"$f":"IF(C15=0,\"\",VLOOKUP($C15,seznam!$A$1:$E$5058,2,FALSE))","v":""},null,{"$f":"IF($C15=0,\"\",VLOOKUP($C15,'Absolutní-BODY'!$E$2:$O$161,4,FALSE))","v":""},{"$f":"IF($C15=0,\"\",VLOOKUP($C15,'Absolutní-BODY'!$E$2:$O$161,5,FALSE))","v":""},{"$f":"IF($C15=0,\"\",VLOOKUP($C15,'Absolutní-BODY'!$E$2:$O$161,6,FALSE))","v":""},{"$f":"IF($C15=0,\"\",VLOOKUP($C15,'Absolutní-BODY'!$E$2:$O$161,7,FALSE))","v":""},{"$f":"IF($C15=0,\"\",VLOOKUP($C15,'Absolutní-BODY'!$E$2:$O$161,8,FALSE))","v":""},{"$f":"IF($C15=0,\"\",VLOOKUP($C15,'Absolutní-BODY'!$E$2:$O$161,9,FALSE))","v":""},{"$f":"IF($C15=0,\"\",VLOOKUP($C15,'Absolutní-BODY'!$E$2:$O$161,10,FALSE))","v":""},{"$f":"IF($C15=0,\"\",VLOOKUP($C15,'Absolutní-BODY'!$E$2:$O$161,11,FALSE))","v":""},null,2,{"$f":"IF(O15=0,\"\",VLOOKUP($O15,seznam!$A$1:$E$5058,2,FALSE))","v":""},null,{"$f":"IF($O15=0,\"\",VLOOKUP($O15,'Absolutní-BODY'!$E$2:$O$161,4,FALSE))","v":""},{"$f":"IF($O15=0,\"\",VLOOKUP($O15,'Absolutní-BODY'!$E$2:$O$161,5,FALSE))","v":""},{"$f":"IF($O15=0,\"\",VLOOKUP($O15,'Absolutní-BODY'!$E$2:$O$161,6,FALSE))","v":""},{"$f":"IF($O15=0,\"\",VLOOKUP($O15,'Absolutní-BODY'!$E$2:$O$161,7,FALSE))","v":""},{"$f":"IF($O15=0,\"\",VLOOKUP($O15,'Absolutní-BODY'!$E$2:$O$161,8,FALSE))","v":""},{"$f":"IF($O15=0,\"\",VLOOKUP($O15,'Absolutní-BODY'!$E$2:$O$161,9,FALSE))","v":""},{"$f":"IF($O15=0,\"\",VLOOKUP($O15,'Absolutní-BODY'!$E$2:$O$161,10,FALSE))","v":""},{"$f":"IF($O15=0,\"\",VLOOKUP($O15,'Absolutní-BODY'!$E$2:$O$161,11,FALSE))","v":""},null,2,{"$f":"IF(AA15=0,\"\",VLOOKUP($AA15,seznam!$A$1:$E$5058,2,FALSE))","v":""},null,{"$f":"IF($AA15=0,\"\",VLOOKUP($AA15,'Absolutní-BODY'!$E$2:$O$161,4,FALSE))","v":""},{"$f":"IF($AA15=0,\"\",VLOOKUP($AA15,'Absolutní-BODY'!$E$2:$O$161,5,FALSE))","v":""},{"$f":"IF($AA15=0,\"\",VLOOKUP($AA15,'Absolutní-BODY'!$E$2:$O$161,6,FALSE))","v":""},{"$f":"IF($AA15=0,\"\",VLOOKUP($AA15,'Absolutní-BODY'!$E$2:$O$161,7,FALSE))","v":""},{"$f":"IF($AA15=0,\"\",VLOOKUP($AA15,'Absolutní-BODY'!$E$2:$O$161,8,FALSE))","v":""},{"$f":"IF($AA15=0,\"\",VLOOKUP($AA15,'Absolutní-BODY'!$E$2:$O$161,9,FALSE))","v":""},{"$f":"IF($AA15=0,\"\",VLOOKUP($AA15,'Absolutní-BODY'!$E$2:$O$161,10,FALSE))","v":""},{"$f":"IF($AA15=0,\"\",VLOOKUP($AA15,'Absolutní-BODY'!$E$2:$O$161,11,FALSE))","v":""}]
[3,{"$f":"IF(C16=0,\"\",VLOOKUP($C16,seznam!$A$1:$E$5058,2,FALSE))","v":""},null,{"$f":"IF($C16=0,\"\",VLOOKUP($C16,'Absolutní-BODY'!$E$2:$O$161,4,FALSE))","v":""},{"$f":"IF($C16=0,\"\",VLOOKUP($C16,'Absolutní-BODY'!$E$2:$O$161,5,FALSE))","v":""},{"$f":"IF($C16=0,\"\",VLOOKUP($C16,'Absolutní-BODY'!$E$2:$O$161,6,FALSE))","v":""},{"$f":"IF($C16=0,\"\",VLOOKUP($C16,'Absolutní-BODY'!$E$2:$O$161,7,FALSE))","v":""},{"$f":"IF($C16=0,\"\",VLOOKUP($C16,'Absolutní-BODY'!$E$2:$O$161,8,FALSE))","v":""},{"$f":"IF($C16=0,\"\",VLOOKUP($C16,'Absolutní-BODY'!$E$2:$O$161,9,FALSE))","v":""},{"$f":"IF($C16=0,\"\",VLOOKUP($C16,'Absolutní-BODY'!$E$2:$O$161,10,FALSE))","v":""},{"$f":"IF($C16=0,\"\",VLOOKUP($C16,'Absolutní-BODY'!$E$2:$O$161,11,FALSE))","v":""},null,3,{"$f":"IF(O16=0,\"\",VLOOKUP($O16,seznam!$A$1:$E$5058,2,FALSE))","v":""},null,{"$f":"IF($O16=0,\"\",VLOOKUP($O16,'Absolutní-BODY'!$E$2:$O$161,4,FALSE))","v":""},{"$f":"IF($O16=0,\"\",VLOOKUP($O16,'Absolutní-BODY'!$E$2:$O$161,5,FALSE))","v":""},{"$f":"IF($O16=0,\"\",VLOOKUP($O16,'Absolutní-BODY'!$E$2:$O$161,6,FALSE))","v":""},{"$f":"IF($O16=0,\"\",VLOOKUP($O16,'Absolutní-BODY'!$E$2:$O$161,7,FALSE))","v":""},{"$f":"IF($O16=0,\"\",VLOOKUP($O16,'Absolutní-BODY'!$E$2:$O$161,8,FALSE))","v":""},{"$f":"IF($O16=0,\"\",VLOOKUP($O16,'Absolutní-BODY'!$E$2:$O$161,9,FALSE))","v":""},{"$f":"IF($O16=0,\"\",VLOOKUP($O16,'Absolutní-BODY'!$E$2:$O$161,10,FALSE))","v":""},{"$f":"IF($O16=0,\"\",VLOOKUP($O16,'Absolutní-BODY'!$E$2:$O$161,11,FALSE))","v":""},null,3,{"$f":"IF(AA16=0,\"\",VLOOKUP($AA16,seznam!$A$1:$E$5058,2,FALSE))","v":""},null,{"$f":"IF($AA16=0,\"\",VLOOKUP($AA16,'Absolutní-BODY'!$E$2:$O$161,4,FALSE))","v":""},{"$f":"IF($AA16=0,\"\",VLOOKUP($AA16,'Absolutní-BODY'!$E$2:$O$161,5,FALSE))","v":""},{"$f":"IF($AA16=0,\"\",VLOOKUP($AA16,'Absolutní-BODY'!$E$2:$O$161,6,FALSE))","v":""},{"$f":"IF($AA16=0,\"\",VLOOKUP($AA16,'Absolutní-BODY'!$E$2:$O$161,7,FALSE))","v":""},{"$f":"IF($AA16=0,\"\",VLOOKUP($AA16,'Absolutní-BODY'!$E$2:$O$161,8,FALSE))","v":""},{"$f":"IF($AA16=0,\"\",VLOOKUP($AA16,'Absolutní-BODY'!$E$2:$O$161,9,FALSE))","v":""},{"$f":"IF($AA16=0,\"\",VLOOKUP($AA16,'Absolutní-BODY'!$E$2:$O$161,10,FALSE))","v":""},{"$f":"IF($AA16=0,\"\",VLOOKUP($AA16,'Absolutní-BODY'!$E$2:$O$161,11,FALSE))","v":""}]
["N",{"$f":"IF(C17=0,\"\",VLOOKUP($C17,seznam!$A$1:$E$5058,2,FALSE))","v":""},null,{"$f":"IF($C17=0,\"\",VLOOKUP($C17,'Absolutní-BODY'!$E$2:$O$161,4,FALSE))","v":""},{"$f":"IF($C17=0,\"\",VLOOKUP($C17,'Absolutní-BODY'!$E$2:$O$161,5,FALSE))","v":""},{"$f":"IF($C17=0,\"\",VLOOKUP($C17,'Absolutní-BODY'!$E$2:$O$161,6,FALSE))","v":""},{"$f":"IF($C17=0,\"\",VLOOKUP($C17,'Absolutní-BODY'!$E$2:$O$161,7,FALSE))","v":""},{"$f":"IF($C17=0,\"\",VLOOKUP($C17,'Absolutní-BODY'!$E$2:$O$161,8,FALSE))","v":""},{"$f":"IF($C17=0,\"\",VLOOKUP($C17,'Absolutní-BODY'!$E$2:$O$161,9,FALSE))","v":""},{"$f":"IF($C17=0,\"\",VLOOKUP($C17,'Absolutní-BODY'!$E$2:$O$161,10,FALSE))","v":""},{"$f":"IF($C17=0,\"\",VLOOKUP($C17,'Absolutní-BODY'!$E$2:$O$161,11,FALSE))","v":""},null,"N",{"$f":"IF(O17=0,\"\",VLOOKUP($O17,seznam!$A$1:$E$5058,2,FALSE))","v":""},null,{"$f":"IF($O17=0,\"\",VLOOKUP($O17,'Absolutní-BODY'!$E$2:$O$161,4,FALSE))","v":""},{"$f":"IF($O17=0,\"\",VLOOKUP($O17,'Absolutní-BODY'!$E$2:$O$161,5,FALSE))","v":""},{"$f":"IF($O17=0,\"\",VLOOKUP($O17,'Absolutní-BODY'!$E$2:$O$161,6,FALSE))","v":""},{"$f":"IF($O17=0,\"\",VLOOKUP($O17,'Absolutní-BODY'!$E$2:$O$161,7,FALSE))","v":""},{"$f":"IF($O17=0,\"\",VLOOKUP($O17,'Absolutní-BODY'!$E$2:$O$161,8,FALSE))","v":""},{"$f":"IF($O17=0,\"\",VLOOKUP($O17,'Absolutní-BODY'!$E$2:$O$161,9,FALSE))","v":""},{"$f":"IF($O17=0,\"\",VLOOKUP($O17,'Absolutní-BODY'!$E$2:$O$161,10,FALSE))","v":""},{"$f":"IF($O17=0,\"\",VLOOKUP($O17,'Absolutní-BODY'!$E$2:$O$161,11,FALSE))","v":""},null,"N",{"$f":"IF(AA17=0,\"\",VLOOKUP($AA17,seznam!$A$1:$E$5058,2,FALSE))","v":""},null,{"$f":"IF($AA17=0,\"\",VLOOKUP($AA17,'Absolutní-BODY'!$E$2:$O$161,4,FALSE))","v":""},{"$f":"IF($AA17=0,\"\",VLOOKUP($AA17,'Absolutní-BODY'!$E$2:$O$161,5,FALSE))","v":""},{"$f":"IF($AA17=0,\"\",VLOOKUP($AA17,'Absolutní-BODY'!$E$2:$O$161,6,FALSE))","v":""},{"$f":"IF($AA17=0,\"\",VLOOKUP($AA17,'Absolutní-BODY'!$E$2:$O$161,7,FALSE))","v":""},{"$f":"IF($AA17=0,\"\",VLOOKUP($AA17,'Absolutní-BODY'!$E$2:$O$161,8,FALSE))","v":""},{"$f":"IF($AA17=0,\"\",VLOOKUP($AA17,'Absolutní-BODY'!$E$2:$O$161,9,FALSE))","v":""},{"$f":"IF($AA17=0,\"\",VLOOKUP($AA17,'Absolutní-BODY'!$E$2:$O$161,10,FALSE))","v":""},{"$f":"IF($AA17=0,\"\",VLOOKUP($AA17,'Absolutní-BODY'!$E$2:$O$161,11,FALSE))","v":""}]
[null,null,null,{"$f":"SUM(D14:D17)","v":0},0,0,0,0,0,0,0,null,null,null,null,{"$f":"SUM(P14:P17)","v":0},0,0,0,0,0,0,0,null,null,null,null,{"$f":"SUM(AB14:AB17)","v":0},0,0,0,0,0,0,0]
[null,null,"bodů",null,null,null,null,"celkem  ",null,{"$f":"SUM(D18:K18)","v":0},null,null,null,null,"bodů",null,null,null,null,"celkem  ",null,{"$f":"SUM(P18:W18)","v":0},null,null,null,null,"bodů",null,null,null,null,"celkem  ",null,{"$f":"SUM(AB18:AI18)","v":0}]
[]
[null,"7. místo",null,null,null,null,null,null,null,null,null,null,null,"8. místo",null,null,null,null,null,null,null,null,null,null,null,"9. místo"]
[null,null,"reg",1,2,3,4,5,6,7,8,null,null,null,"reg",1,2,3,4,5,6,7,8,null,null,null,"reg",1,2,3,4,5,6,7,8]
[1,{"$f":"IF(C23=0,\"\",VLOOKUP($C23,seznam!$A$1:$E$5058,2,FALSE))","v":""},null,{"$f":"IF($C23=0,\"\",VLOOKUP($C23,'Absolutní-BODY'!$E$2:$O$161,4,FALSE))","v":""},{"$f":"IF($C23=0,\"\",VLOOKUP($C23,'Absolutní-BODY'!$E$2:$O$161,5,FALSE))","v":""},{"$f":"IF($C23=0,\"\",VLOOKUP($C23,'Absolutní-BODY'!$E$2:$O$161,6,FALSE))","v":""},{"$f":"IF($C23=0,\"\",VLOOKUP($C23,'Absolutní-BODY'!$E$2:$O$161,7,FALSE))","v":""},{"$f":"IF($C23=0,\"\",VLOOKUP($C23,'Absolutní-BODY'!$E$2:$O$161,8,FALSE))","v":""},{"$f":"IF($C23=0,\"\",VLOOKUP($C23,'Absolutní-BODY'!$E$2:$O$161,9,FALSE))","v":""},{"$f":"IF($C23=0,\"\",VLOOKUP($C23,'Absolutní-BODY'!$E$2:$O$161,10,FALSE))","v":""},{"$f":"IF($C23=0,\"\",VLOOKUP($C23,'Absolutní-BODY'!$E$2:$O$161,11,FALSE))","v":""},null,1,{"$f":"IF(O23=0,\"\",VLOOKUP($O23,seznam!$A$1:$E$5058,2,FALSE))","v":""},null,{"$f":"IF($O23=0,\"\",VLOOKUP($O23,'Absolutní-BODY'!$E$2:$O$161,4,FALSE))","v":""},{"$f":"IF($O23=0,\"\",VLOOKUP($O23,'Absolutní-BODY'!$E$2:$O$161,5,FALSE))","v":""},{"$f":"IF($O23=0,\"\",VLOOKUP($O23,'Absolutní-BODY'!$E$2:$O$161,6,FALSE))","v":""},{"$f":"IF($O23=0,\"\",VLOOKUP($O23,'Absolutní-BODY'!$E$2:$O$161,7,FALSE))","v":""},{"$f":"IF($O23=0,\"\",VLOOKUP($O23,'Absolutní-BODY'!$E$2:$O$161,8,FALSE))","v":""},{"$f":"IF($O23=0,\"\",VLOOKUP($O23,'Absolutní-BODY'!$E$2:$O$161,9,FALSE))","v":""},{"$f":"IF($O23=0,\"\",VLOOKUP($O23,'Absolutní-BODY'!$E$2:$O$161,10,FALSE))","v":""},{"$f":"IF($O23=0,\"\",VLOOKUP($O23,'Absolutní-BODY'!$E$2:$O$161,11,FALSE))","v":""},null,1,{"$f":"IF(AA23=0,\"\",VLOOKUP($AA23,seznam!$A$1:$E$5058,2,FALSE))","v":""},null,{"$f":"IF($AA23=0,\"\",VLOOKUP($AA23,'Absolutní-BODY'!$E$2:$O$161,4,FALSE))","v":""},{"$f":"IF($AA23=0,\"\",VLOOKUP($AA23,'Absolutní-BODY'!$E$2:$O$161,5,FALSE))","v":""},{"$f":"IF($AA23=0,\"\",VLOOKUP($AA23,'Absolutní-BODY'!$E$2:$O$161,6,FALSE))","v":""},{"$f":"IF($AA23=0,\"\",VLOOKUP($AA23,'Absolutní-BODY'!$E$2:$O$161,7,FALSE))","v":""},{"$f":"IF($AA23=0,\"\",VLOOKUP($AA23,'Absolutní-BODY'!$E$2:$O$161,8,FALSE))","v":""},{"$f":"IF($AA23=0,\"\",VLOOKUP($AA23,'Absolutní-BODY'!$E$2:$O$161,9,FALSE))","v":""},{"$f":"IF($AA23=0,\"\",VLOOKUP($AA23,'Absolutní-BODY'!$E$2:$O$161,10,FALSE))","v":""},{"$f":"IF($AA23=0,\"\",VLOOKUP($AA23,'Absolutní-BODY'!$E$2:$O$161,11,FALSE))","v":""}]
[2,{"$f":"IF(C24=0,\"\",VLOOKUP($C24,seznam!$A$1:$E$5058,2,FALSE))","v":""},null,{"$f":"IF($C24=0,\"\",VLOOKUP($C24,'Absolutní-BODY'!$E$2:$O$161,4,FALSE))","v":""},{"$f":"IF($C24=0,\"\",VLOOKUP($C24,'Absolutní-BODY'!$E$2:$O$161,5,FALSE))","v":""},{"$f":"IF($C24=0,\"\",VLOOKUP($C24,'Absolutní-BODY'!$E$2:$O$161,6,FALSE))","v":""},{"$f":"IF($C24=0,\"\",VLOOKUP($C24,'Absolutní-BODY'!$E$2:$O$161,7,FALSE))","v":""},{"$f":"IF($C24=0,\"\",VLOOKUP($C24,'Absolutní-BODY'!$E$2:$O$161,8,FALSE))","v":""},{"$f":"IF($C24=0,\"\",VLOOKUP($C24,'Absolutní-BODY'!$E$2:$O$161,9,FALSE))","v":""},{"$f":"IF($C24=0,\"\",VLOOKUP($C24,'Absolutní-BODY'!$E$2:$O$161,10,FALSE))","v":""},{"$f":"IF($C24=0,\"\",VLOOKUP($C24,'Absolutní-BODY'!$E$2:$O$161,11,FALSE))","v":""},null,2,{"$f":"IF(O24=0,\"\",VLOOKUP($O24,seznam!$A$1:$E$5058,2,FALSE))","v":""},null,{"$f":"IF($O24=0,\"\",VLOOKUP($O24,'Absolutní-BODY'!$E$2:$O$161,4,FALSE))","v":""},{"$f":"IF($O24=0,\"\",VLOOKUP($O24,'Absolutní-BODY'!$E$2:$O$161,5,FALSE))","v":""},{"$f":"IF($O24=0,\"\",VLOOKUP($O24,'Absolutní-BODY'!$E$2:$O$161,6,FALSE))","v":""},{"$f":"IF($O24=0,\"\",VLOOKUP($O24,'Absolutní-BODY'!$E$2:$O$161,7,FALSE))","v":""},{"$f":"IF($O24=0,\"\",VLOOKUP($O24,'Absolutní-BODY'!$E$2:$O$161,8,FALSE))","v":""},{"$f":"IF($O24=0,\"\",VLOOKUP($O24,'Absolutní-BODY'!$E$2:$O$161,9,FALSE))","v":""},{"$f":"IF($O24=0,\"\",VLOOKUP($O24,'Absolutní-BODY'!$E$2:$O$161,10,FALSE))","v":""},{"$f":"IF($O24=0,\"\",VLOOKUP($O24,'Absolutní-BODY'!$E$2:$O$161,11,FALSE))","v":""},null,2,{"$f":"IF(AA24=0,\"\",VLOOKUP($AA24,seznam!$A$1:$E$5058,2,FALSE))","v":""},null,{"$f":"IF($AA24=0,\"\",VLOOKUP($AA24,'Absolutní-BODY'!$E$2:$O$161,4,FALSE))","v":""},{"$f":"IF($AA24=0,\"\",VLOOKUP($AA24,'Absolutní-BODY'!$E$2:$O$161,5,FALSE))","v":""},{"$f":"IF($AA24=0,\"\",VLOOKUP($AA24,'Absolutní-BODY'!$E$2:$O$161,6,FALSE))","v":""},{"$f":"IF($AA24=0,\"\",VLOOKUP($AA24,'Absolutní-BODY'!$E$2:$O$161,7,FALSE))","v":""},{"$f":"IF($AA24=0,\"\",VLOOKUP($AA24,'Absolutní-BODY'!$E$2:$O$161,8,FALSE))","v":""},{"$f":"IF($AA24=0,\"\",VLOOKUP($AA24,'Absolutní-BODY'!$E$2:$O$161,9,FALSE))","v":""},{"$f":"IF($AA24=0,\"\",VLOOKUP($AA24,'Absolutní-BODY'!$E$2:$O$161,10,FALSE))","v":""},{"$f":"IF($AA24=0,\"\",VLOOKUP($AA24,'Absolutní-BODY'!$E$2:$O$161,11,FALSE))","v":""}]
[3,{"$f":"IF(C25=0,\"\",VLOOKUP($C25,seznam!$A$1:$E$5058,2,FALSE))","v":""},null,{"$f":"IF($C25=0,\"\",VLOOKUP($C25,'Absolutní-BODY'!$E$2:$O$161,4,FALSE))","v":""},{"$f":"IF($C25=0,\"\",VLOOKUP($C25,'Absolutní-BODY'!$E$2:$O$161,5,FALSE))","v":""},{"$f":"IF($C25=0,\"\",VLOOKUP($C25,'Absolutní-BODY'!$E$2:$O$161,6,FALSE))","v":""},{"$f":"IF($C25=0,\"\",VLOOKUP($C25,'Absolutní-BODY'!$E$2:$O$161,7,FALSE))","v":""},{"$f":"IF($C25=0,\"\",VLOOKUP($C25,'Absolutní-BODY'!$E$2:$O$161,8,FALSE))","v":""},{"$f":"IF($C25=0,\"\",VLOOKUP($C25,'Absolutní-BODY'!$E$2:$O$161,9,FALSE))","v":""},{"$f":"IF($C25=0,\"\",VLOOKUP($C25,'Absolutní-BODY'!$E$2:$O$161,10,FALSE))","v":""},{"$f":"IF($C25=0,\"\",VLOOKUP($C25,'Absolutní-BODY'!$E$2:$O$161,11,FALSE))","v":""},null,3,{"$f":"IF(O25=0,\"\",VLOOKUP($O25,seznam!$A$1:$E$5058,2,FALSE))","v":""},null,{"$f":"IF($O25=0,\"\",VLOOKUP($O25,'Absolutní-BODY'!$E$2:$O$161,4,FALSE))","v":""},{"$f":"IF($O25=0,\"\",VLOOKUP($O25,'Absolutní-BODY'!$E$2:$O$161,5,FALSE))","v":""},{"$f":"IF($O25=0,\"\",VLOOKUP($O25,'Absolutní-BODY'!$E$2:$O$161,6,FALSE))","v":""},{"$f":"IF($O25=0,\"\",VLOOKUP($O25,'Absolutní-BODY'!$E$2:$O$161,7,FALSE))","v":""},{"$f":"IF($O25=0,\"\",VLOOKUP($O25,'Absolutní-BODY'!$E$2:$O$161,8,FALSE))","v":""},{"$f":"IF($O25=0,\"\",VLOOKUP($O25,'Absolutní-BODY'!$E$2:$O$161,9,FALSE))","v":""},{"$f":"IF($O25=0,\"\",VLOOKUP($O25,'Absolutní-BODY'!$E$2:$O$161,10,FALSE))","v":""},{"$f":"IF($O25=0,\"\",VLOOKUP($O25,'Absolutní-BODY'!$E$2:$O$161,11,FALSE))","v":""},null,3,{"$f":"IF(AA25=0,\"\",VLOOKUP($AA25,seznam!$A$1:$E$5058,2,FALSE))","v":""},null,{"$f":"IF($AA25=0,\"\",VLOOKUP($AA25,'Absolutní-BODY'!$E$2:$O$161,4,FALSE))","v":""},{"$f":"IF($AA25=0,\"\",VLOOKUP($AA25,'Absolutní-BODY'!$E$2:$O$161,5,FALSE))","v":""},{"$f":"IF($AA25=0,\"\",VLOOKUP($AA25,'Absolutní-BODY'!$E$2:$O$161,6,FALSE))","v":""},{"$f":"IF($AA25=0,\"\",VLOOKUP($AA25,'Absolutní-BODY'!$E$2:$O$161,7,FALSE))","v":""},{"$f":"IF($AA25=0,\"\",VLOOKUP($AA25,'Absolutní-BODY'!$E$2:$O$161,8,FALSE))","v":""},{"$f":"IF($AA25=0,\"\",VLOOKUP($AA25,'Absolutní-BODY'!$E$2:$O$161,9,FALSE))","v":""},{"$f":"IF($AA25=0,\"\",VLOOKUP($AA25,'Absolutní-BODY'!$E$2:$O$161,10,FALSE))","v":""},{"$f":"IF($AA25=0,\"\",VLOOKUP($AA25,'Absolutní-BODY'!$E$2:$O$161,11,FALSE))","v":""}]
["N",{"$f":"IF(C26=0,\"\",VLOOKUP($C26,seznam!$A$1:$E$5058,2,FALSE))","v":""},null,{"$f":"IF($C26=0,\"\",VLOOKUP($C26,'Absolutní-BODY'!$E$2:$O$161,4,FALSE))","v":""},{"$f":"IF($C26=0,\"\",VLOOKUP($C26,'Absolutní-BODY'!$E$2:$O$161,5,FALSE))","v":""},{"$f":"IF($C26=0,\"\",VLOOKUP($C26,'Absolutní-BODY'!$E$2:$O$161,6,FALSE))","v":""},{"$f":"IF($C26=0,\"\",VLOOKUP($C26,'Absolutní-BODY'!$E$2:$O$161,7,FALSE))","v":""},{"$f":"IF($C26=0,\"\",VLOOKUP($C26,'Absolutní-BODY'!$E$2:$O$161,8,FALSE))","v":""},{"$f":"IF($C26=0,\"\",VLOOKUP($C26,'Absolutní-BODY'!$E$2:$O$161,9,FALSE))","v":""},{"$f":"IF($C26=0,\"\",VLOOKUP($C26,'Absolutní-BODY'!$E$2:$O$161,10,FALSE))","v":""},{"$f":"IF($C26=0,\"\",VLOOKUP($C26,'Absolutní-BODY'!$E$2:$O$161,11,FALSE))","v":""},null,"N",{"$f":"IF(O26=0,\"\",VLOOKUP($O26,seznam!$A$1:$E$5058,2,FALSE))","v":""},null,{"$f":"IF($O26=0,\"\",VLOOKUP($O26,'Absolutní-BODY'!$E$2:$O$161,4,FALSE))","v":""},{"$f":"IF($O26=0,\"\",VLOOKUP($O26,'Absolutní-BODY'!$E$2:$O$161,5,FALSE))","v":""},{"$f":"IF($O26=0,\"\",VLOOKUP($O26,'Absolutní-BODY'!$E$2:$O$161,6,FALSE))","v":""},{"$f":"IF($O26=0,\"\",VLOOKUP($O26,'Absolutní-BODY'!$E$2:$O$161,7,FALSE))","v":""},{"$f":"IF($O26=0,\"\",VLOOKUP($O26,'Absolutní-BODY'!$E$2:$O$161,8,FALSE))","v":""},{"$f":"IF($O26=0,\"\",VLOOKUP($O26,'Absolutní-BODY'!$E$2:$O$161,9,FALSE))","v":""},{"$f":"IF($O26=0,\"\",VLOOKUP($O26,'Absolutní-BODY'!$E$2:$O$161,10,FALSE))","v":""},{"$f":"IF($O26=0,\"\",VLOOKUP($O26,'Absolutní-BODY'!$E$2:$O$161,11,FALSE))","v":""},null,"N",{"$f":"IF(AA26=0,\"\",VLOOKUP($AA26,seznam!$A$1:$E$5058,2,FALSE))","v":""},null,{"$f":"IF($AA26=0,\"\",VLOOKUP($AA26,'Absolutní-BODY'!$E$2:$O$161,4,FALSE))","v":""},{"$f":"IF($AA26=0,\"\",VLOOKUP($AA26,'Absolutní-BODY'!$E$2:$O$161,5,FALSE))","v":""},{"$f":"IF($AA26=0,\"\",VLOOKUP($AA26,'Absolutní-BODY'!$E$2:$O$161,6,FALSE))","v":""},{"$f":"IF($AA26=0,\"\",VLOOKUP($AA26,'Absolutní-BODY'!$E$2:$O$161,7,FALSE))","v":""},{"$f":"IF($AA26=0,\"\",VLOOKUP($AA26,'Absolutní-BODY'!$E$2:$O$161,8,FALSE))","v":""},{"$f":"IF($AA26=0,\"\",VLOOKUP($AA26,'Absolutní-BODY'!$E$2:$O$161,9,FALSE))","v":""},{"$f":"IF($AA26=0,\"\",VLOOKUP($AA26,'Absolutní-BODY'!$E$2:$O$161,10,FALSE))","v":""},{"$f":"IF($AA26=0,\"\",VLOOKUP($AA26,'Absolutní-BODY'!$E$2:$O$161,11,FALSE))","v":""}]
[null,null,null,{"$f":"SUM(D23:D26)","v":0},0,0,0,0,0,0,0,null,null,null,null,{"$f":"SUM(P23:P26)","v":0},0,0,0,0,0,0,0,null,null,null,null,{"$f":"SUM(AB23:AB26)","v":0},0,0,0,0,0,0,0]
[null,null,"bodů",null,null,null,null,"celkem  ",null,{"$f":"SUM(D27:K27)","v":0},null,null,null,null,"bodů",null,null,null,null,"celkem  ",null,{"$f":"SUM(P27:W27)","v":0},null,null,null,null,"bodů",null,null,null,null,"celkem  ",null,{"$f":"SUM(AB27:AI27)","v":0}]
[]
[null,"10. místo"]
[null,null,"reg",1,2,3,4,5,6,7,8]
[1,{"$f":"IF(C32=0,\"\",VLOOKUP($C32,seznam!$A$1:$E$5058,2,FALSE))","v":""},null,{"$f":"IF($C32=0,\"\",VLOOKUP($C32,'Absolutní-BODY'!$E$2:$O$161,4,FALSE))","v":""},{"$f":"IF($C32=0,\"\",VLOOKUP($C32,'Absolutní-BODY'!$E$2:$O$161,5,FALSE))","v":""},{"$f":"IF($C32=0,\"\",VLOOKUP($C32,'Absolutní-BODY'!$E$2:$O$161,6,FALSE))","v":""},{"$f":"IF($C32=0,\"\",VLOOKUP($C32,'Absolutní-BODY'!$E$2:$O$161,7,FALSE))","v":""},{"$f":"IF($C32=0,\"\",VLOOKUP($C32,'Absolutní-BODY'!$E$2:$O$161,8,FALSE))","v":""},{"$f":"IF($C32=0,\"\",VLOOKUP($C32,'Absolutní-BODY'!$E$2:$O$161,9,FALSE))","v":""},{"$f":"IF($C32=0,\"\",VLOOKUP($C32,'Absolutní-BODY'!$E$2:$O$161,10,FALSE))","v":""},{"$f":"IF($C32=0,\"\",VLOOKUP($C32,'Absolutní-BODY'!$E$2:$O$161,11,FALSE))","v":""}]
[2,{"$f":"IF(C33=0,\"\",VLOOKUP($C33,seznam!$A$1:$E$5058,2,FALSE))","v":""},null,{"$f":"IF($C33=0,\"\",VLOOKUP($C33,'Absolutní-BODY'!$E$2:$O$161,4,FALSE))","v":""},{"$f":"IF($C33=0,\"\",VLOOKUP($C33,'Absolutní-BODY'!$E$2:$O$161,5,FALSE))","v":""},{"$f":"IF($C33=0,\"\",VLOOKUP($C33,'Absolutní-BODY'!$E$2:$O$161,6,FALSE))","v":""},{"$f":"IF($C33=0,\"\",VLOOKUP($C33,'Absolutní-BODY'!$E$2:$O$161,7,FALSE))","v":""},{"$f":"IF($C33=0,\"\",VLOOKUP($C33,'Absolutní-BODY'!$E$2:$O$161,8,FALSE))","v":""},{"$f":"IF($C33=0,\"\",VLOOKUP($C33,'Absolutní-BODY'!$E$2:$O$161,9,FALSE))","v":""},{"$f":"IF($C33=0,\"\",VLOOKUP($C33,'Absolutní-BODY'!$E$2:$O$161,10,FALSE))","v":""},{"$f":"IF($C33=0,\"\",VLOOKUP($C33,'Absolutní-BODY'!$E$2:$O$161,11,FALSE))","v":""}]
[3,{"$f":"IF(C34=0,\"\",VLOOKUP($C34,seznam!$A$1:$E$5058,2,FALSE))","v":""},null,{"$f":"IF($C34=0,\"\",VLOOKUP($C34,'Absolutní-BODY'!$E$2:$O$161,4,FALSE))","v":""},{"$f":"IF($C34=0,\"\",VLOOKUP($C34,'Absolutní-BODY'!$E$2:$O$161,5,FALSE))","v":""},{"$f":"IF($C34=0,\"\",VLOOKUP($C34,'Absolutní-BODY'!$E$2:$O$161,6,FALSE))","v":""},{"$f":"IF($C34=0,\"\",VLOOKUP($C34,'Absolutní-BODY'!$E$2:$O$161,7,FALSE))","v":""},{"$f":"IF($C34=0,\"\",VLOOKUP($C34,'Absolutní-BODY'!$E$2:$O$161,8,FALSE))","v":""},{"$f":"IF($C34=0,\"\",VLOOKUP($C34,'Absolutní-BODY'!$E$2:$O$161,9,FALSE))","v":""},{"$f":"IF($C34=0,\"\",VLOOKUP($C34,'Absolutní-BODY'!$E$2:$O$161,10,FALSE))","v":""},{"$f":"IF($C34=0,\"\",VLOOKUP($C34,'Absolutní-BODY'!$E$2:$O$161,11,FALSE))","v":""}]
["N",{"$f":"IF(C35=0,\"\",VLOOKUP($C35,seznam!$A$1:$E$5058,2,FALSE))","v":""},null,{"$f":"IF($C35=0,\"\",VLOOKUP($C35,'Absolutní-BODY'!$E$2:$O$161,4,FALSE))","v":""},{"$f":"IF($C35=0,\"\",VLOOKUP($C35,'Absolutní-BODY'!$E$2:$O$161,5,FALSE))","v":""},{"$f":"IF($C35=0,\"\",VLOOKUP($C35,'Absolutní-BODY'!$E$2:$O$161,6,FALSE))","v":""},{"$f":"IF($C35=0,\"\",VLOOKUP($C35,'Absolutní-BODY'!$E$2:$O$161,7,FALSE))","v":""},{"$f":"IF($C35=0,\"\",VLOOKUP($C35,'Absolutní-BODY'!$E$2:$O$161,8,FALSE))","v":""},{"$f":"IF($C35=0,\"\",VLOOKUP($C35,'Absolutní-BODY'!$E$2:$O$161,9,FALSE))","v":""},{"$f":"IF($C35=0,\"\",VLOOKUP($C35,'Absolutní-BODY'!$E$2:$O$161,10,FALSE))","v":""},{"$f":"IF($C35=0,\"\",VLOOKUP($C35,'Absolutní-BODY'!$E$2:$O$161,11,FALSE))","v":""}]
[null,null,null,{"$f":"SUM(D32:D35)","v":0},0,0,0,0,0,0,0]
[null,null,"bodů",null,null,null,null,"celkem  ",null,{"$f":"SUM(D36:K36)","v":0}]

{"sheet":"Liga-kolo-J","index":8,"n_rows":28,"n_cols":35,"rows_kept":28,"cut":false,"hidden":true,"merged":[[27,9,27,10],[27,21,27,22],[9,9,9,10],[9,21,9,22],[0,2,0,3],[0,4,0,12],[9,33,9,34],[18,9,18,10],[18,21,18,22],[18,33,18,34]]}
["?",".kolo","?",null,"liga juniorských družstev",null,null,null,null,null,null,null,null,"2012 / 2013"]
[]
[null,"1. místo",null,null,null,null,null,null,null,null,null,null,null,"2. místo",null,null,null,null,null,null,null,null,null,null,null,"3. místo"]
[null,null,"reg",1,2,3,4,5,6,7,8,null,null,null,"reg",1,2,3,4,5,6,7,8,null,null,null,"reg",1,2,3,4,5,6,7,8]
[1,{"$f":"IF(C5=0,\"\",VLOOKUP($C5,seznam!$A$1:$E$5058,2,FALSE))","v":""},null,{"$f":"IF($C5=0,\"\",VLOOKUP($C5,'Absolutní-BODY'!$E$2:$O$161,4,FALSE))","v":""},{"$f":"IF($C5=0,\"\",VLOOKUP($C5,'Absolutní-BODY'!$E$2:$O$161,5,FALSE))","v":""},{"$f":"IF($C5=0,\"\",VLOOKUP($C5,'Absolutní-BODY'!$E$2:$O$161,6,FALSE))","v":""},{"$f":"IF($C5=0,\"\",VLOOKUP($C5,'Absolutní-BODY'!$E$2:$O$161,7,FALSE))","v":""},{"$f":"IF($C5=0,\"\",VLOOKUP($C5,'Absolutní-BODY'!$E$2:$O$161,8,FALSE))","v":""},{"$f":"IF($C5=0,\"\",VLOOKUP($C5,'Absolutní-BODY'!$E$2:$O$161,9,FALSE))","v":""},{"$f":"IF($C5=0,\"\",VLOOKUP($C5,'Absolutní-BODY'!$E$2:$O$161,10,FALSE))","v":""},{"$f":"IF($C5=0,\"\",VLOOKUP($C5,'Absolutní-BODY'!$E$2:$O$161,11,FALSE))","v":""},null,1,{"$f":"IF(O5=0,\"\",VLOOKUP($O5,seznam!$A$1:$E$5058,2,FALSE))","v":""},null,{"$f":"IF($O5=0,\"\",VLOOKUP($O5,'Absolutní-BODY'!$E$2:$O$161,4,FALSE))","v":""},{"$f":"IF($O5=0,\"\",VLOOKUP($O5,'Absolutní-BODY'!$E$2:$O$161,5,FALSE))","v":""},{"$f":"IF($O5=0,\"\",VLOOKUP($O5,'Absolutní-BODY'!$E$2:$O$161,6,FALSE))","v":""},{"$f":"IF($O5=0,\"\",VLOOKUP($O5,'Absolutní-BODY'!$E$2:$O$161,7,FALSE))","v":""},{"$f":"IF($O5=0,\"\",VLOOKUP($O5,'Absolutní-BODY'!$E$2:$O$161,8,FALSE))","v":""},{"$f":"IF($O5=0,\"\",VLOOKUP($O5,'Absolutní-BODY'!$E$2:$O$161,9,FALSE))","v":""},{"$f":"IF($O5=0,\"\",VLOOKUP($O5,'Absolutní-BODY'!$E$2:$O$161,10,FALSE))","v":""},{"$f":"IF($O5=0,\"\",VLOOKUP($O5,'Absolutní-BODY'!$E$2:$O$161,11,FALSE))","v":""},null,1,{"$f":"IF(AA5=0,\"\",VLOOKUP($AA5,seznam!$A$1:$E$5058,2,FALSE))","v":""},null,{"$f":"IF($AA5=0,\"\",VLOOKUP($AA5,'Absolutní-BODY'!$E$2:$O$161,4,FALSE))","v":""},{"$f":"IF($AA5=0,\"\",VLOOKUP($AA5,'Absolutní-BODY'!$E$2:$O$161,5,FALSE))","v":""},{"$f":"IF($AA5=0,\"\",VLOOKUP($AA5,'Absolutní-BODY'!$E$2:$O$161,6,FALSE))","v":""},{"$f":"IF($AA5=0,\"\",VLOOKUP($AA5,'Absolutní-BODY'!$E$2:$O$161,7,FALSE))","v":""},{"$f":"IF($AA5=0,\"\",VLOOKUP($AA5,'Absolutní-BODY'!$E$2:$O$161,8,FALSE))","v":""},{"$f":"IF($AA5=0,\"\",VLOOKUP($AA5,'Absolutní-BODY'!$E$2:$O$161,9,FALSE))","v":""},{"$f":"IF($AA5=0,\"\",VLOOKUP($AA5,'Absolutní-BODY'!$E$2:$O$161,10,FALSE))","v":""},{"$f":"IF($AA5=0,\"\",VLOOKUP($AA5,'Absolutní-BODY'!$E$2:$O$161,11,FALSE))","v":""}]
[2,{"$f":"IF(C6=0,\"\",VLOOKUP($C6,seznam!$A$1:$E$5058,2,FALSE))","v":""},null,{"$f":"IF($C6=0,\"\",VLOOKUP($C6,'Absolutní-BODY'!$E$2:$O$161,4,FALSE))","v":""},{"$f":"IF($C6=0,\"\",VLOOKUP($C6,'Absolutní-BODY'!$E$2:$O$161,5,FALSE))","v":""},{"$f":"IF($C6=0,\"\",VLOOKUP($C6,'Absolutní-BODY'!$E$2:$O$161,6,FALSE))","v":""},{"$f":"IF($C6=0,\"\",VLOOKUP($C6,'Absolutní-BODY'!$E$2:$O$161,7,FALSE))","v":""},{"$f":"IF($C6=0,\"\",VLOOKUP($C6,'Absolutní-BODY'!$E$2:$O$161,8,FALSE))","v":""},{"$f":"IF($C6=0,\"\",VLOOKUP($C6,'Absolutní-BODY'!$E$2:$O$161,9,FALSE))","v":""},{"$f":"IF($C6=0,\"\",VLOOKUP($C6,'Absolutní-BODY'!$E$2:$O$161,10,FALSE))","v":""},{"$f":"IF($C6=0,\"\",VLOOKUP($C6,'Absolutní-BODY'!$E$2:$O$161,11,FALSE))","v":""},null,2,{"$f":"IF(O6=0,\"\",VLOOKUP($O6,seznam!$A$1:$E$5058,2,FALSE))","v":""},null,{"$f":"IF($O6=0,\"\",VLOOKUP($O6,'Absolutní-BODY'!$E$2:$O$161,4,FALSE))","v":""},{"$f":"IF($O6=0,\"\",VLOOKUP($O6,'Absolutní-BODY'!$E$2:$O$161,5,FALSE))","v":""},{"$f":"IF($O6=0,\"\",VLOOKUP($O6,'Absolutní-BODY'!$E$2:$O$161,6,FALSE))","v":""},{"$f":"IF($O6=0,\"\",VLOOKUP($O6,'Absolutní-BODY'!$E$2:$O$161,7,FALSE))","v":""},{"$f":"IF($O6=0,\"\",VLOOKUP($O6,'Absolutní-BODY'!$E$2:$O$161,8,FALSE))","v":""},{"$f":"IF($O6=0,\"\",VLOOKUP($O6,'Absolutní-BODY'!$E$2:$O$161,9,FALSE))","v":""},{"$f":"IF($O6=0,\"\",VLOOKUP($O6,'Absolutní-BODY'!$E$2:$O$161,10,FALSE))","v":""},{"$f":"IF($O6=0,\"\",VLOOKUP($O6,'Absolutní-BODY'!$E$2:$O$161,11,FALSE))","v":""},null,2,{"$f":"IF(AA6=0,\"\",VLOOKUP($AA6,seznam!$A$1:$E$5058,2,FALSE))","v":""},null,{"$f":"IF($AA6=0,\"\",VLOOKUP($AA6,'Absolutní-BODY'!$E$2:$O$161,4,FALSE))","v":""},{"$f":"IF($AA6=0,\"\",VLOOKUP($AA6,'Absolutní-BODY'!$E$2:$O$161,5,FALSE))","v":""},{"$f":"IF($AA6=0,\"\",VLOOKUP($AA6,'Absolutní-BODY'!$E$2:$O$161,6,FALSE))","v":""},{"$f":"IF($AA6=0,\"\",VLOOKUP($AA6,'Absolutní-BODY'!$E$2:$O$161,7,FALSE))","v":""},{"$f":"IF($AA6=0,\"\",VLOOKUP($AA6,'Absolutní-BODY'!$E$2:$O$161,8,FALSE))","v":""},{"$f":"IF($AA6=0,\"\",VLOOKUP($AA6,'Absolutní-BODY'!$E$2:$O$161,9,FALSE))","v":""},{"$f":"IF($AA6=0,\"\",VLOOKUP($AA6,'Absolutní-BODY'!$E$2:$O$161,10,FALSE))","v":""},{"$f":"IF($AA6=0,\"\",VLOOKUP($AA6,'Absolutní-BODY'!$E$2:$O$161,11,FALSE))","v":""}]
[3,{"$f":"IF(C7=0,\"\",VLOOKUP($C7,seznam!$A$1:$E$5058,2,FALSE))","v":""},null,{"$f":"IF($C7=0,\"\",VLOOKUP($C7,'Absolutní-BODY'!$E$2:$O$161,4,FALSE))","v":""},{"$f":"IF($C7=0,\"\",VLOOKUP($C7,'Absolutní-BODY'!$E$2:$O$161,5,FALSE))","v":""},{"$f":"IF($C7=0,\"\",VLOOKUP($C7,'Absolutní-BODY'!$E$2:$O$161,6,FALSE))","v":""},{"$f":"IF($C7=0,\"\",VLOOKUP($C7,'Absolutní-BODY'!$E$2:$O$161,7,FALSE))","v":""},{"$f":"IF($C7=0,\"\",VLOOKUP($C7,'Absolutní-BODY'!$E$2:$O$161,8,FALSE))","v":""},{"$f":"IF($C7=0,\"\",VLOOKUP($C7,'Absolutní-BODY'!$E$2:$O$161,9,FALSE))","v":""},{"$f":"IF($C7=0,\"\",VLOOKUP($C7,'Absolutní-BODY'!$E$2:$O$161,10,FALSE))","v":""},{"$f":"IF($C7=0,\"\",VLOOKUP($C7,'Absolutní-BODY'!$E$2:$O$161,11,FALSE))","v":""},null,3,{"$f":"IF(O7=0,\"\",VLOOKUP($O7,seznam!$A$1:$E$5058,2,FALSE))","v":""},null,{"$f":"IF($O7=0,\"\",VLOOKUP($O7,'Absolutní-BODY'!$E$2:$O$161,4,FALSE))","v":""},{"$f":"IF($O7=0,\"\",VLOOKUP($O7,'Absolutní-BODY'!$E$2:$O$161,5,FALSE))","v":""},{"$f":"IF($O7=0,\"\",VLOOKUP($O7,'Absolutní-BODY'!$E$2:$O$161,6,FALSE))","v":""},{"$f":"IF($O7=0,\"\",VLOOKUP($O7,'Absolutní-BODY'!$E$2:$O$161,7,FALSE))","v":""},{"$f":"IF($O7=0,\"\",VLOOKUP($O7,'Absolutní-BODY'!$E$2:$O$161,8,FALSE))","v":""},{"$f":"IF($O7=0,\"\",VLOOKUP($O7,'Absolutní-BODY'!$E$2:$O$161,9,FALSE))","v":""},{"$f":"IF($O7=0,\"\",VLOOKUP($O7,'Absolutní-BODY'!$E$2:$O$161,10,FALSE))","v":""},{"$f":"IF($O7=0,\"\",VLOOKUP($O7,'Absolutní-BODY'!$E$2:$O$161,11,FALSE))","v":""},null,3,{"$f":"IF(AA7=0,\"\",VLOOKUP($AA7,seznam!$A$1:$E$5058,2,FALSE))","v":""},null,{"$f":"IF($AA7=0,\"\",VLOOKUP($AA7,'Absolutní-BODY'!$E$2:$O$161,4,FALSE))","v":""},{"$f":"IF($AA7=0,\"\",VLOOKUP($AA7,'Absolutní-BODY'!$E$2:$O$161,5,FALSE))","v":""},{"$f":"IF($AA7=0,\"\",VLOOKUP($AA7,'Absolutní-BODY'!$E$2:$O$161,6,FALSE))","v":""},{"$f":"IF($AA7=0,\"\",VLOOKUP($AA7,'Absolutní-BODY'!$E$2:$O$161,7,FALSE))","v":""},{"$f":"IF($AA7=0,\"\",VLOOKUP($AA7,'Absolutní-BODY'!$E$2:$O$161,8,FALSE))","v":""},{"$f":"IF($AA7=0,\"\",VLOOKUP($AA7,'Absolutní-BODY'!$E$2:$O$161,9,FALSE))","v":""},{"$f":"IF($AA7=0,\"\",VLOOKUP($AA7,'Absolutní-BODY'!$E$2:$O$161,10,FALSE))","v":""},{"$f":"IF($AA7=0,\"\",VLOOKUP($AA7,'Absolutní-BODY'!$E$2:$O$161,11,FALSE))","v":""}]
["N",{"$f":"IF(C8=0,\"\",VLOOKUP($C8,seznam!$A$1:$E$5058,2,FALSE))","v":""},null,{"$f":"IF($C8=0,\"\",VLOOKUP($C8,'Absolutní-BODY'!$E$2:$O$161,4,FALSE))","v":""},{"$f":"IF($C8=0,\"\",VLOOKUP($C8,'Absolutní-BODY'!$E$2:$O$161,5,FALSE))","v":""},{"$f":"IF($C8=0,\"\",VLOOKUP($C8,'Absolutní-BODY'!$E$2:$O$161,6,FALSE))","v":""},{"$f":"IF($C8=0,\"\",VLOOKUP($C8,'Absolutní-BODY'!$E$2:$O$161,7,FALSE))","v":""},{"$f":"IF($C8=0,\"\",VLOOKUP($C8,'Absolutní-BODY'!$E$2:$O$161,8,FALSE))","v":""},{"$f":"IF($C8=0,\"\",VLOOKUP($C8,'Absolutní-BODY'!$E$2:$O$161,9,FALSE))","v":""},{"$f":"IF($C8=0,\"\",VLOOKUP($C8,'Absolutní-BODY'!$E$2:$O$161,10,FALSE))","v":""},{"$f":"IF($C8=0,\"\",VLOOKUP($C8,'Absolutní-BODY'!$E$2:$O$161,11,FALSE))","v":""},null,"N",{"$f":"IF(O8=0,\"\",VLOOKUP($O8,seznam!$A$1:$E$5058,2,FALSE))","v":""},null,{"$f":"IF($O8=0,\"\",VLOOKUP($O8,'Absolutní-BODY'!$E$2:$O$161,4,FALSE))","v":""},{"$f":"IF($O8=0,\"\",VLOOKUP($O8,'Absolutní-BODY'!$E$2:$O$161,5,FALSE))","v":""},{"$f":"IF($O8=0,\"\",VLOOKUP($O8,'Absolutní-BODY'!$E$2:$O$161,6,FALSE))","v":""},{"$f":"IF($O8=0,\"\",VLOOKUP($O8,'Absolutní-BODY'!$E$2:$O$161,7,FALSE))","v":""},{"$f":"IF($O8=0,\"\",VLOOKUP($O8,'Absolutní-BODY'!$E$2:$O$161,8,FALSE))","v":""},{"$f":"IF($O8=0,\"\",VLOOKUP($O8,'Absolutní-BODY'!$E$2:$O$161,9,FALSE))","v":""},{"$f":"IF($O8=0,\"\",VLOOKUP($O8,'Absolutní-BODY'!$E$2:$O$161,10,FALSE))","v":""},{"$f":"IF($O8=0,\"\",VLOOKUP($O8,'Absolutní-BODY'!$E$2:$O$161,11,FALSE))","v":""},null,"N",{"$f":"IF(AA8=0,\"\",VLOOKUP($AA8,seznam!$A$1:$E$5058,2,FALSE))","v":""},null,{"$f":"IF($AA8=0,\"\",VLOOKUP($AA8,'Absolutní-BODY'!$E$2:$O$161,4,FALSE))","v":""},{"$f":"IF($AA8=0,\"\",VLOOKUP($AA8,'Absolutní-BODY'!$E$2:$O$161,5,FALSE))","v":""},{"$f":"IF($AA8=0,\"\",VLOOKUP($AA8,'Absolutní-BODY'!$E$2:$O$161,6,FALSE))","v":""},{"$f":"IF($AA8=0,\"\",VLOOKUP($AA8,'Absolutní-BODY'!$E$2:$O$161,7,FALSE))","v":""},{"$f":"IF($AA8=0,\"\",VLOOKUP($AA8,'Absolutní-BODY'!$E$2:$O$161,8,FALSE))","v":""},{"$f":"IF($AA8=0,\"\",VLOOKUP($AA8,'Absolutní-BODY'!$E$2:$O$161,9,FALSE))","v":""},{"$f":"IF($AA8=0,\"\",VLOOKUP($AA8,'Absolutní-BODY'!$E$2:$O$161,10,FALSE))","v":""},{"$f":"IF($AA8=0,\"\",VLOOKUP($AA8,'Absolutní-BODY'!$E$2:$O$161,11,FALSE))","v":""}]
[null,null,null,{"$f":"SUM(D5:D8)","v":0},0,0,0,0,0,0,0,null,null,null,null,{"$f":"SUM(P5:P8)","v":0},0,0,0,0,0,0,0,null,null,null,null,{"$f":"SUM(AB5:AB8)","v":0},0,0,0,0,0,0,0]
[null,null,"bodů",null,null,null,null,"celkem  ",null,{"$f":"SUM(D9:K9)","v":0},null,null,null,null,"bodů",null,null,null,null,"celkem  ",null,{"$f":"SUM(P9:W9)","v":0},null,null,null,null,"bodů",null,null,null,null,"celkem  ",null,{"$f":"SUM(AB9:AI9)","v":0}]
[]
[null,"4. místo",null,null,null,null,null,null,null,null,null,null,null,"5. místo",null,null,null,null,null,null,null,null,null,null,null,"6. místo"]
[null,null,"reg",1,2,3,4,5,6,7,8,null,null,null,"reg",1,2,3,4,5,6,7,8,null,null,null,"reg",1,2,3,4,5,6,7,8]
[1,{"$f":"IF(C14=0,\"\",VLOOKUP($C14,seznam!$A$1:$E$5058,2,FALSE))","v":""},null,{"$f":"IF($C14=0,\"\",VLOOKUP($C14,'Absolutní-BODY'!$E$2:$O$161,4,FALSE))","v":""},{"$f":"IF($C14=0,\"\",VLOOKUP($C14,'Absolutní-BODY'!$E$2:$O$161,5,FALSE))","v":""},{"$f":"IF($C14=0,\"\",VLOOKUP($C14,'Absolutní-BODY'!$E$2:$O$161,6,FALSE))","v":""},{"$f":"IF($C14=0,\"\",VLOOKUP($C14,'Absolutní-BODY'!$E$2:$O$161,7,FALSE))","v":""},{"$f":"IF($C14=0,\"\",VLOOKUP($C14,'Absolutní-BODY'!$E$2:$O$161,8,FALSE))","v":""},{"$f":"IF($C14=0,\"\",VLOOKUP($C14,'Absolutní-BODY'!$E$2:$O$161,9,FALSE))","v":""},{"$f":"IF($C14=0,\"\",VLOOKUP($C14,'Absolutní-BODY'!$E$2:$O$161,10,FALSE))","v":""},{"$f":"IF($C14=0,\"\",VLOOKUP($C14,'Absolutní-BODY'!$E$2:$O$161,11,FALSE))","v":""},null,1,{"$f":"IF(O14=0,\"\",VLOOKUP($O14,seznam!$A$1:$E$5058,2,FALSE))","v":""},null,{"$f":"IF($O14=0,\"\",VLOOKUP($O14,'Absolutní-BODY'!$E$2:$O$161,4,FALSE))","v":""},{"$f":"IF($O14=0,\"\",VLOOKUP($O14,'Absolutní-BODY'!$E$2:$O$161,5,FALSE))","v":""},{"$f":"IF($O14=0,\"\",VLOOKUP($O14,'Absolutní-BODY'!$E$2:$O$161,6,FALSE))","v":""},{"$f":"IF($O14=0,\"\",VLOOKUP($O14,'Absolutní-BODY'!$E$2:$O$161,7,FALSE))","v":""},{"$f":"IF($O14=0,\"\",VLOOKUP($O14,'Absolutní-BODY'!$E$2:$O$161,8,FALSE))","v":""},{"$f":"IF($O14=0,\"\",VLOOKUP($O14,'Absolutní-BODY'!$E$2:$O$161,9,FALSE))","v":""},{"$f":"IF($O14=0,\"\",VLOOKUP($O14,'Absolutní-BODY'!$E$2:$O$161,10,FALSE))","v":""},{"$f":"IF($O14=0,\"\",VLOOKUP($O14,'Absolutní-BODY'!$E$2:$O$161,11,FALSE))","v":""},null,1,{"$f":"IF(AA14=0,\"\",VLOOKUP($AA14,seznam!$A$1:$E$5058,2,FALSE))","v":""},null,{"$f":"IF($AA14=0,\"\",VLOOKUP($AA14,'Absolutní-BODY'!$E$2:$O$161,4,FALSE))","v":""},{"$f":"IF($AA14=0,\"\",VLOOKUP($AA14,'Absolutní-BODY'!$E$2:$O$161,5,FALSE))","v":""},{"$f":"IF($AA14=0,\"\",VLOOKUP($AA14,'Absolutní-BODY'!$E$2:$O$161,6,FALSE))","v":""},{"$f":"IF($AA14=0,\"\",VLOOKUP($AA14,'Absolutní-BODY'!$E$2:$O$161,7,FALSE))","v":""},{"$f":"IF($AA14=0,\"\",VLOOKUP($AA14,'Absolutní-BODY'!$E$2:$O$161,8,FALSE))","v":""},{"$f":"IF($AA14=0,\"\",VLOOKUP($AA14,'Absolutní-BODY'!$E$2:$O$161,9,FALSE))","v":""},{"$f":"IF($AA14=0,\"\",VLOOKUP($AA14,'Absolutní-BODY'!$E$2:$O$161,10,FALSE))","v":""},{"$f":"IF($AA14=0,\"\",VLOOKUP($AA14,'Absolutní-BODY'!$E$2:$O$161,11,FALSE))","v":""}]
[2,{"$f":"IF(C15=0,\"\",VLOOKUP($C15,seznam!$A$1:$E$5058,2,FALSE))","v":""},null,{"$f":"IF($C15=0,\"\",VLOOKUP($C15,'Absolutní-BODY'!$E$2:$O$161,4,FALSE))","v":""},{"$f":"IF($C15=0,\"\",VLOOKUP($C15,'Absolutní-BODY'!$E$2:$O$161,5,FALSE))","v":""},{"$f":"IF($C15=0,\"\",VLOOKUP($C15,'Absolutní-BODY'!$E$2:$O$161,6,FALSE))","v":""},{"$f":"IF($C15=0,\"\",VLOOKUP($C15,'Absolutní-BODY'!$E$2:$O$161,7,FALSE))","v":""},{"$f":"IF($C15=0,\"\",VLOOKUP($C15,'Absolutní-BODY'!$E$2:$O$161,8,FALSE))","v":""},{"$f":"IF($C15=0,\"\",VLOOKUP($C15,'Absolutní-BODY'!$E$2:$O$161,9,FALSE))","v":""},{"$f":"IF($C15=0,\"\",VLOOKUP($C15,'Absolutní-BODY'!$E$2:$O$161,10,FALSE))","v":""},{"$f":"IF($C15=0,\"\",VLOOKUP($C15,'Absolutní-BODY'!$E$2:$O$161,11,FALSE))","v":""},null,2,{"$f":"IF(O15=0,\"\",VLOOKUP($O15,seznam!$A$1:$E$5058,2,FALSE))","v":""},null,{"$f":"IF($O15=0,\"\",VLOOKUP($O15,'Absolutní-BODY'!$E$2:$O$161,4,FALSE))","v":""},{"$f":"IF($O15=0,\"\",VLOOKUP($O15,'Absolutní-BODY'!$E$2:$O$161,5,FALSE))","v":""},{"$f":"IF($O15=0,\"\",VLOOKUP($O15,'Absolutní-BODY'!$E$2:$O$161,6,FALSE))","v":""},{"$f":"IF($O15=0,\"\",VLOOKUP($O15,'Absolutní-BODY'!$E$2:$O$161,7,FALSE))","v":""},{"$f":"IF($O15=0,\"\",VLOOKUP($O15,'Absolutní-BODY'!$E$2:$O$161,8,FALSE))","v":""},{"$f":"IF($O15=0,\"\",VLOOKUP($O15,'Absolutní-BODY'!$E$2:$O$161,9,FALSE))","v":""},{"$f":"IF($O15=0,\"\",VLOOKUP($O15,'Absolutní-BODY'!$E$2:$O$161,10,FALSE))","v":""},{"$f":"IF($O15=0,\"\",VLOOKUP($O15,'Absolutní-BODY'!$E$2:$O$161,11,FALSE))","v":""},null,2,{"$f":"IF(AA15=0,\"\",VLOOKUP($AA15,seznam!$A$1:$E$5058,2,FALSE))","v":""},null,{"$f":"IF($AA15=0,\"\",VLOOKUP($AA15,'Absolutní-BODY'!$E$2:$O$161,4,FALSE))","v":""},{"$f":"IF($AA15=0,\"\",VLOOKUP($AA15,'Absolutní-BODY'!$E$2:$O$161,5,FALSE))","v":""},{"$f":"IF($AA15=0,\"\",VLOOKUP($AA15,'Absolutní-BODY'!$E$2:$O$161,6,FALSE))","v":""},{"$f":"IF($AA15=0,\"\",VLOOKUP($AA15,'Absolutní-BODY'!$E$2:$O$161,7,FALSE))","v":""},{"$f":"IF($AA15=0,\"\",VLOOKUP($AA15,'Absolutní-BODY'!$E$2:$O$161,8,FALSE))","v":""},{"$f":"IF($AA15=0,\"\",VLOOKUP($AA15,'Absolutní-BODY'!$E$2:$O$161,9,FALSE))","v":""},{"$f":"IF($AA15=0,\"\",VLOOKUP($AA15,'Absolutní-BODY'!$E$2:$O$161,10,FALSE))","v":""},{"$f":"IF($AA15=0,\"\",VLOOKUP($AA15,'Absolutní-BODY'!$E$2:$O$161,11,FALSE))","v":""}]
[3,{"$f":"IF(C16=0,\"\",VLOOKUP($C16,seznam!$A$1:$E$5058,2,FALSE))","v":""},null,{"$f":"IF($C16=0,\"\",VLOOKUP($C16,'Absolutní-BODY'!$E$2:$O$161,4,FALSE))","v":""},{"$f":"IF($C16=0,\"\",VLOOKUP($C16,'Absolutní-BODY'!$E$2:$O$161,5,FALSE))","v":""},{"$f":"IF($C16=0,\"\",VLOOKUP($C16,'Absolutní-BODY'!$E$2:$O$161,6,FALSE))","v":""},{"$f":"IF($C16=0,\"\",VLOOKUP($C16,'Absolutní-BODY'!$E$2:$O$161,7,FALSE))","v":""},{"$f":"IF($C16=0,\"\",VLOOKUP($C16,'Absolutní-BODY'!$E$2:$O$161,8,FALSE))","v":""},{"$f":"IF($C16=0,\"\",VLOOKUP($C16,'Absolutní-BODY'!$E$2:$O$161,9,FALSE))","v":""},{"$f":"IF($C16=0,\"\",VLOOKUP($C16,'Absolutní-BODY'!$E$2:$O$161,10,FALSE))","v":""},{"$f":"IF($C16=0,\"\",VLOOKUP($C16,'Absolutní-BODY'!$E$2:$O$161,11,FALSE))","v":""},null,3,{"$f":"IF(O16=0,\"\",VLOOKUP($O16,seznam!$A$1:$E$5058,2,FALSE))","v":""},null,{"$f":"IF($O16=0,\"\",VLOOKUP($O16,'Absolutní-BODY'!$E$2:$O$161,4,FALSE))","v":""},{"$f":"IF($O16=0,\"\",VLOOKUP($O16,'Absolutní-BODY'!$E$2:$O$161,5,FALSE))","v":""},{"$f":"IF($O16=0,\"\",VLOOKUP($O16,'Absolutní-BODY'!$E$2:$O$161,6,FALSE))","v":""},{"$f":"IF($O16=0,\"\",VLOOKUP($O16,'Absolutní-BODY'!$E$2:$O$161,7,FALSE))","v":""},{"$f":"IF($O16=0,\"\",VLOOKUP($O16,'Absolutní-BODY'!$E$2:$O$161,8,FALSE))","v":""},{"$f":"IF($O16=0,\"\",VLOOKUP($O16,'Absolutní-BODY'!$E$2:$O$161,9,FALSE))","v":""},{"$f":"IF($O16=0,\"\",VLOOKUP($O16,'Absolutní-BODY'!$E$2:$O$161,10,FALSE))","v":""},{"$f":"IF($O16=0,\"\",VLOOKUP($O16,'Absolutní-BODY'!$E$2:$O$161,11,FALSE))","v":""},null,3,{"$f":"IF(AA16=0,\"\",VLOOKUP($AA16,seznam!$A$1:$E$5058,2,FALSE))","v":""},null,{"$f":"IF($AA16=0,\"\",VLOOKUP($AA16,'Absolutní-BODY'!$E$2:$O$161,4,FALSE))","v":""},{"$f":"IF($AA16=0,\"\",VLOOKUP($AA16,'Absolutní-BODY'!$E$2:$O$161,5,FALSE))","v":""},{"$f":"IF($AA16=0,\"\",VLOOKUP($AA16,'Absolutní-BODY'!$E$2:$O$161,6,FALSE))","v":""},{"$f":"IF($AA16=0,\"\",VLOOKUP($AA16,'Absolutní-BODY'!$E$2:$O$161,7,FALSE))","v":""},{"$f":"IF($AA16=0,\"\",VLOOKUP($AA16,'Absolutní-BODY'!$E$2:$O$161,8,FALSE))","v":""},{"$f":"IF($AA16=0,\"\",VLOOKUP($AA16,'Absolutní-BODY'!$E$2:$O$161,9,FALSE))","v":""},{"$f":"IF($AA16=0,\"\",VLOOKUP($AA16,'Absolutní-BODY'!$E$2:$O$161,10,FALSE))","v":""},{"$f":"IF($AA16=0,\"\",VLOOKUP($AA16,'Absolutní-BODY'!$E$2:$O$161,11,FALSE))","v":""}]
["N",{"$f":"IF(C17=0,\"\",VLOOKUP($C17,seznam!$A$1:$E$5058,2,FALSE))","v":""},null,{"$f":"IF($C17=0,\"\",VLOOKUP($C17,'Absolutní-BODY'!$E$2:$O$161,4,FALSE))","v":""},{"$f":"IF($C17=0,\"\",VLOOKUP($C17,'Absolutní-BODY'!$E$2:$O$161,5,FALSE))","v":""},{"$f":"IF($C17=0,\"\",VLOOKUP($C17,'Absolutní-BODY'!$E$2:$O$161,6,FALSE))","v":""},{"$f":"IF($C17=0,\"\",VLOOKUP($C17,'Absolutní-BODY'!$E$2:$O$161,7,FALSE))","v":""},{"$f":"IF($C17=0,\"\",VLOOKUP($C17,'Absolutní-BODY'!$E$2:$O$161,8,FALSE))","v":""},{"$f":"IF($C17=0,\"\",VLOOKUP($C17,'Absolutní-BODY'!$E$2:$O$161,9,FALSE))","v":""},{"$f":"IF($C17=0,\"\",VLOOKUP($C17,'Absolutní-BODY'!$E$2:$O$161,10,FALSE))","v":""},{"$f":"IF($C17=0,\"\",VLOOKUP($C17,'Absolutní-BODY'!$E$2:$O$161,11,FALSE))","v":""},null,"N",{"$f":"IF(O17=0,\"\",VLOOKUP($O17,seznam!$A$1:$E$5058,2,FALSE))","v":""},null,{"$f":"IF($O17=0,\"\",VLOOKUP($O17,'Absolutní-BODY'!$E$2:$O$161,4,FALSE))","v":""},{"$f":"IF($O17=0,\"\",VLOOKUP($O17,'Absolutní-BODY'!$E$2:$O$161,5,FALSE))","v":""},{"$f":"IF($O17=0,\"\",VLOOKUP($O17,'Absolutní-BODY'!$E$2:$O$161,6,FALSE))","v":""},{"$f":"IF($O17=0,\"\",VLOOKUP($O17,'Absolutní-BODY'!$E$2:$O$161,7,FALSE))","v":""},{"$f":"IF($O17=0,\"\",VLOOKUP($O17,'Absolutní-BODY'!$E$2:$O$161,8,FALSE))","v":""},{"$f":"IF($O17=0,\"\",VLOOKUP($O17,'Absolutní-BODY'!$E$2:$O$161,9,FALSE))","v":""},{"$f":"IF($O17=0,\"\",VLOOKUP($O17,'Absolutní-BODY'!$E$2:$O$161,10,FALSE))","v":""},{"$f":"IF($O17=0,\"\",VLOOKUP($O17,'Absolutní-BODY'!$E$2:$O$161,11,FALSE))","v":""},null,"N",{"$f":"IF(AA17=0,\"\",VLOOKUP($AA17,seznam!$A$1:$E$5058,2,FALSE))","v":""},null,{"$f":"IF($AA17=0,\"\",VLOOKUP($AA17,'Absolutní-BODY'!$E$2:$O$161,4,FALSE))","v":""},{"$f":"IF($AA17=0,\"\",VLOOKUP($AA17,'Absolutní-BODY'!$E$2:$O$161,5,FALSE))","v":""},{"$f":"IF($AA17=0,\"\",VLOOKUP($AA17,'Absolutní-BODY'!$E$2:$O$161,6,FALSE))","v":""},{"$f":"IF($AA17=0,\"\",VLOOKUP($AA17,'Absolutní-BODY'!$E$2:$O$161,7,FALSE))","v":""},{"$f":"IF($AA17=0,\"\",VLOOKUP($AA17,'Absolutní-BODY'!$E$2:$O$161,8,FALSE))","v":""},{"$f":"IF($AA17=0,\"\",VLOOKUP($AA17,'Absolutní-BODY'!$E$2:$O$161,9,FALSE))","v":""},{"$f":"IF($AA17=0,\"\",VLOOKUP($AA17,'Absolutní-BODY'!$E$2:$O$161,10,FALSE))","v":""},{"$f":"IF($AA17=0,\"\",VLOOKUP($AA17,'Absolutní-BODY'!$E$2:$O$161,11,FALSE))","v":""}]
[null,null,null,{"$f":"SUM(D14:D17)","v":0},0,0,0,0,0,0,0,null,null,null,null,{"$f":"SUM(P14:P17)","v":0},0,0,0,0,0,0,0,null,null,null,null,{"$f":"SUM(AB14:AB17)","v":0},0,0,0,0,0,0,0]
[null,null,"bodů",null,null,null,null,"celkem  ",null,{"$f":"SUM(D18:K18)","v":0},null,null,null,null,"bodů",null,null,null,null,"celkem  ",null,{"$f":"SUM(P18:W18)","v":0},null,null,null,null,"bodů",null,null,null,null,"celkem  ",null,{"$f":"SUM(AB18:AI18)","v":0}]
[]
[null,"7. místo",null,null,null,null,null,null,null,null,null,null,null,"8. místo"]
[null,null,"reg",1,2,3,4,5,6,7,8,null,null,null,"reg",1,2,3,4,5,6,7,8]
[1,{"$f":"IF(C23=0,\"\",VLOOKUP($C23,seznam!$A$1:$E$5058,2,FALSE))","v":""},null,{"$f":"IF($C23=0,\"\",VLOOKUP($C23,'Absolutní-BODY'!$E$2:$O$161,4,FALSE))","v":""},{"$f":"IF($C23=0,\"\",VLOOKUP($C23,'Absolutní-BODY'!$E$2:$O$161,5,FALSE))","v":""},{"$f":"IF($C23=0,\"\",VLOOKUP($C23,'Absolutní-BODY'!$E$2:$O$161,6,FALSE))","v":""},{"$f":"IF($C23=0,\"\",VLOOKUP($C23,'Absolutní-BODY'!$E$2:$O$161,7,FALSE))","v":""},{"$f":"IF($C23=0,\"\",VLOOKUP($C23,'Absolutní-BODY'!$E$2:$O$161,8,FALSE))","v":""},{"$f":"IF($C23=0,\"\",VLOOKUP($C23,'Absolutní-BODY'!$E$2:$O$161,9,FALSE))","v":""},{"$f":"IF($C23=0,\"\",VLOOKUP($C23,'Absolutní-BODY'!$E$2:$O$161,10,FALSE))","v":""},{"$f":"IF($C23=0,\"\",VLOOKUP($C23,'Absolutní-BODY'!$E$2:$O$161,11,FALSE))","v":""},null,1,{"$f":"IF(O23=0,\"\",VLOOKUP($O23,seznam!$A$1:$E$5058,2,FALSE))","v":""},null,{"$f":"IF($O23=0,\"\",VLOOKUP($O23,'Absolutní-BODY'!$E$2:$O$161,4,FALSE))","v":""},{"$f":"IF($O23=0,\"\",VLOOKUP($O23,'Absolutní-BODY'!$E$2:$O$161,5,FALSE))","v":""},{"$f":"IF($O23=0,\"\",VLOOKUP($O23,'Absolutní-BODY'!$E$2:$O$161,6,FALSE))","v":""},{"$f":"IF($O23=0,\"\",VLOOKUP($O23,'Absolutní-BODY'!$E$2:$O$161,7,FALSE))","v":""},{"$f":"IF($O23=0,\"\",VLOOKUP($O23,'Absolutní-BODY'!$E$2:$O$161,8,FALSE))","v":""},{"$f":"IF($O23=0,\"\",VLOOKUP($O23,'Absolutní-BODY'!$E$2:$O$161,9,FALSE))","v":""},{"$f":"IF($O23=0,\"\",VLOOKUP($O23,'Absolutní-BODY'!$E$2:$O$161,10,FALSE))","v":""},{"$f":"IF($O23=0,\"\",VLOOKUP($O23,'Absolutní-BODY'!$E$2:$O$161,11,FALSE))","v":""}]
[2,{"$f":"IF(C24=0,\"\",VLOOKUP($C24,seznam!$A$1:$E$5058,2,FALSE))","v":""},null,{"$f":"IF($C24=0,\"\",VLOOKUP($C24,'Absolutní-BODY'!$E$2:$O$161,4,FALSE))","v":""},{"$f":"IF($C24=0,\"\",VLOOKUP($C24,'Absolutní-BODY'!$E$2:$O$161,5,FALSE))","v":""},{"$f":"IF($C24=0,\"\",VLOOKUP($C24,'Absolutní-BODY'!$E$2:$O$161,6,FALSE))","v":""},{"$f":"IF($C24=0,\"\",VLOOKUP($C24,'Absolutní-BODY'!$E$2:$O$161,7,FALSE))","v":""},{"$f":"IF($C24=0,\"\",VLOOKUP($C24,'Absolutní-BODY'!$E$2:$O$161,8,FALSE))","v":""},{"$f":"IF($C24=0,\"\",VLOOKUP($C24,'Absolutní-BODY'!$E$2:$O$161,9,FALSE))","v":""},{"$f":"IF($C24=0,\"\",VLOOKUP($C24,'Absolutní-BODY'!$E$2:$O$161,10,FALSE))","v":""},{"$f":"IF($C24=0,\"\",VLOOKUP($C24,'Absolutní-BODY'!$E$2:$O$161,11,FALSE))","v":""},null,2,{"$f":"IF(O24=0,\"\",VLOOKUP($O24,seznam!$A$1:$E$5058,2,FALSE))","v":""},null,{"$f":"IF($O24=0,\"\",VLOOKUP($O24,'Absolutní-BODY'!$E$2:$O$161,4,FALSE))","v":""},{"$f":"IF($O24=0,\"\",VLOOKUP($O24,'Absolutní-BODY'!$E$2:$O$161,5,FALSE))","v":""},{"$f":"IF($O24=0,\"\",VLOOKUP($O24,'Absolutní-BODY'!$E$2:$O$161,6,FALSE))","v":""},{"$f":"IF($O24=0,\"\",VLOOKUP($O24,'Absolutní-BODY'!$E$2:$O$161,7,FALSE))","v":""},{"$f":"IF($O24=0,\"\",VLOOKUP($O24,'Absolutní-BODY'!$E$2:$O$161,8,FALSE))","v":""},{"$f":"IF($O24=0,\"\",VLOOKUP($O24,'Absolutní-BODY'!$E$2:$O$161,9,FALSE))","v":""},{"$f":"IF($O24=0,\"\",VLOOKUP($O24,'Absolutní-BODY'!$E$2:$O$161,10,FALSE))","v":""},{"$f":"IF($O24=0,\"\",VLOOKUP($O24,'Absolutní-BODY'!$E$2:$O$161,11,FALSE))","v":""}]
[3,{"$f":"IF(C25=0,\"\",VLOOKUP($C25,seznam!$A$1:$E$5058,2,FALSE))","v":""},null,{"$f":"IF($C25=0,\"\",VLOOKUP($C25,'Absolutní-BODY'!$E$2:$O$161,4,FALSE))","v":""},{"$f":"IF($C25=0,\"\",VLOOKUP($C25,'Absolutní-BODY'!$E$2:$O$161,5,FALSE))","v":""},{"$f":"IF($C25=0,\"\",VLOOKUP($C25,'Absolutní-BODY'!$E$2:$O$161,6,FALSE))","v":""},{"$f":"IF($C25=0,\"\",VLOOKUP($C25,'Absolutní-BODY'!$E$2:$O$161,7,FALSE))","v":""},{"$f":"IF($C25=0,\"\",VLOOKUP($C25,'Absolutní-BODY'!$E$2:$O$161,8,FALSE))","v":""},{"$f":"IF($C25=0,\"\",VLOOKUP($C25,'Absolutní-BODY'!$E$2:$O$161,9,FALSE))","v":""},{"$f":"IF($C25=0,\"\",VLOOKUP($C25,'Absolutní-BODY'!$E$2:$O$161,10,FALSE))","v":""},{"$f":"IF($C25=0,\"\",VLOOKUP($C25,'Absolutní-BODY'!$E$2:$O$161,11,FALSE))","v":""},null,3,{"$f":"IF(O25=0,\"\",VLOOKUP($O25,seznam!$A$1:$E$5058,2,FALSE))","v":""},null,{"$f":"IF($O25=0,\"\",VLOOKUP($O25,'Absolutní-BODY'!$E$2:$O$161,4,FALSE))","v":""},{"$f":"IF($O25=0,\"\",VLOOKUP($O25,'Absolutní-BODY'!$E$2:$O$161,5,FALSE))","v":""},{"$f":"IF($O25=0,\"\",VLOOKUP($O25,'Absolutní-BODY'!$E$2:$O$161,6,FALSE))","v":""},{"$f":"IF($O25=0,\"\",VLOOKUP($O25,'Absolutní-BODY'!$E$2:$O$161,7,FALSE))","v":""},{"$f":"IF($O25=0,\"\",VLOOKUP($O25,'Absolutní-BODY'!$E$2:$O$161,8,FALSE))","v":""},{"$f":"IF($O25=0,\"\",VLOOKUP($O25,'Absolutní-BODY'!$E$2:$O$161,9,FALSE))","v":""},{"$f":"IF($O25=0,\"\",VLOOKUP($O25,'Absolutní-BODY'!$E$2:$O$161,10,FALSE))","v":""},{"$f":"IF($O25=0,\"\",VLOOKUP($O25,'Absolutní-BODY'!$E$2:$O$161,11,FALSE))","v":""}]
["N",{"$f":"IF(C26=0,\"\",VLOOKUP($C26,seznam!$A$1:$E$5058,2,FALSE))","v":""},null,{"$f":"IF($C26=0,\"\",VLOOKUP($C26,'Absolutní-BODY'!$E$2:$O$161,4,FALSE))","v":""},{"$f":"IF($C26=0,\"\",VLOOKUP($C26,'Absolutní-BODY'!$E$2:$O$161,5,FALSE))","v":""},{"$f":"IF($C26=0,\"\",VLOOKUP($C26,'Absolutní-BODY'!$E$2:$O$161,6,FALSE))","v":""},{"$f":"IF($C26=0,\"\",VLOOKUP($C26,'Absolutní-BODY'!$E$2:$O$161,7,FALSE))","v":""},{"$f":"IF($C26=0,\"\",VLOOKUP($C26,'Absolutní-BODY'!$E$2:$O$161,8,FALSE))","v":""},{"$f":"IF($C26=0,\"\",VLOOKUP($C26,'Absolutní-BODY'!$E$2:$O$161,9,FALSE))","v":""},{"$f":"IF($C26=0,\"\",VLOOKUP($C26,'Absolutní-BODY'!$E$2:$O$161,10,FALSE))","v":""},{"$f":"IF($C26=0,\"\",VLOOKUP($C26,'Absolutní-BODY'!$E$2:$O$161,11,FALSE))","v":""},null,"N",{"$f":"IF(O26=0,\"\",VLOOKUP($O26,seznam!$A$1:$E$5058,2,FALSE))","v":""},null,{"$f":"IF($O26=0,\"\",VLOOKUP($O26,'Absolutní-BODY'!$E$2:$O$161,4,FALSE))","v":""},{"$f":"IF($O26=0,\"\",VLOOKUP($O26,'Absolutní-BODY'!$E$2:$O$161,5,FALSE))","v":""},{"$f":"IF($O26=0,\"\",VLOOKUP($O26,'Absolutní-BODY'!$E$2:$O$161,6,FALSE))","v":""},{"$f":"IF($O26=0,\"\",VLOOKUP($O26,'Absolutní-BODY'!$E$2:$O$161,7,FALSE))","v":""},{"$f":"IF($O26=0,\"\",VLOOKUP($O26,'Absolutní-BODY'!$E$2:$O$161,8,FALSE))","v":""},{"$f":"IF($O26=0,\"\",VLOOKUP($O26,'Absolutní-BODY'!$E$2:$O$161,9,FALSE))","v":""},{"$f":"IF($O26=0,\"\",VLOOKUP($O26,'Absolutní-BODY'!$E$2:$O$161,10,FALSE))","v":""},{"$f":"IF($O26=0,\"\",VLOOKUP($O26,'Absolutní-BODY'!$E$2:$O$161,11,FALSE))","v":""}]
[null,null,null,{"$f":"SUM(D23:D26)","v":0},0,0,0,0,0,0,0,null,null,null,null,{"$f":"SUM(P23:P26)","v":0},0,0,0,0,0,0,0]
[null,null,"bodů",null,null,null,null,"celkem  ",null,{"$f":"SUM(D27:K27)","v":0},null,null,null,null,"bodů",null,null,null,null,"celkem  ",null,{"$f":"SUM(P27:W27)","v":0}]

{"sheet":"Liga-kolo-Jz","index":9,"n_rows":28,"n_cols":35,"rows_kept":28,"cut":false,"hidden":true,"merged":[[27,9,27,10],[27,21,27,22],[9,9,9,10],[9,21,9,22],[0,2,0,3],[0,4,0,12],[9,33,9,34],[18,9,18,10],[18,21,18,22],[18,33,18,34]]}
["?",".kolo","?",null,"liga žákovských družstev",null,null,null,null,null,null,null,null,"2012 / 2013"]
[]
[null,"1. místo",null,null,null,null,null,null,null,null,null,null,null,"2. místo",null,null,null,null,null,null,null,null,null,null,null,"3. místo"]
[null,null,"reg",1,2,3,4,5,6,7,8,null,null,null,"reg",1,2,3,4,5,6,7,8,null,null,null,"reg",1,2,3,4,5,6,7,8]
[1,{"$f":"IF(C5=0,\"\",VLOOKUP($C5,seznam!$A$1:$E$5058,2,FALSE))","v":""},null,{"$f":"IF($C5=0,\"\",VLOOKUP($C5,'Absolutní-BODY'!$E$2:$O$161,4,FALSE))","v":""},{"$f":"IF($C5=0,\"\",VLOOKUP($C5,'Absolutní-BODY'!$E$2:$O$161,5,FALSE))","v":""},{"$f":"IF($C5=0,\"\",VLOOKUP($C5,'Absolutní-BODY'!$E$2:$O$161,6,FALSE))","v":""},{"$f":"IF($C5=0,\"\",VLOOKUP($C5,'Absolutní-BODY'!$E$2:$O$161,7,FALSE))","v":""},{"$f":"IF($C5=0,\"\",VLOOKUP($C5,'Absolutní-BODY'!$E$2:$O$161,8,FALSE))","v":""},{"$f":"IF($C5=0,\"\",VLOOKUP($C5,'Absolutní-BODY'!$E$2:$O$161,9,FALSE))","v":""},{"$f":"IF($C5=0,\"\",VLOOKUP($C5,'Absolutní-BODY'!$E$2:$O$161,10,FALSE))","v":""},{"$f":"IF($C5=0,\"\",VLOOKUP($C5,'Absolutní-BODY'!$E$2:$O$161,11,FALSE))","v":""},null,1,{"$f":"IF(O5=0,\"\",VLOOKUP($O5,seznam!$A$1:$E$5058,2,FALSE))","v":""},null,{"$f":"IF($O5=0,\"\",VLOOKUP($O5,'Absolutní-BODY'!$E$2:$O$161,4,FALSE))","v":""},{"$f":"IF($O5=0,\"\",VLOOKUP($O5,'Absolutní-BODY'!$E$2:$O$161,5,FALSE))","v":""},{"$f":"IF($O5=0,\"\",VLOOKUP($O5,'Absolutní-BODY'!$E$2:$O$161,6,FALSE))","v":""},{"$f":"IF($O5=0,\"\",VLOOKUP($O5,'Absolutní-BODY'!$E$2:$O$161,7,FALSE))","v":""},{"$f":"IF($O5=0,\"\",VLOOKUP($O5,'Absolutní-BODY'!$E$2:$O$161,8,FALSE))","v":""},{"$f":"IF($O5=0,\"\",VLOOKUP($O5,'Absolutní-BODY'!$E$2:$O$161,9,FALSE))","v":""},{"$f":"IF($O5=0,\"\",VLOOKUP($O5,'Absolutní-BODY'!$E$2:$O$161,10,FALSE))","v":""},{"$f":"IF($O5=0,\"\",VLOOKUP($O5,'Absolutní-BODY'!$E$2:$O$161,11,FALSE))","v":""},null,1,{"$f":"IF(AA5=0,\"\",VLOOKUP($AA5,seznam!$A$1:$E$5058,2,FALSE))","v":""},null,{"$f":"IF($AA5=0,\"\",VLOOKUP($AA5,'Absolutní-BODY'!$E$2:$O$161,4,FALSE))","v":""},{"$f":"IF($AA5=0,\"\",VLOOKUP($AA5,'Absolutní-BODY'!$E$2:$O$161,5,FALSE))","v":""},{"$f":"IF($AA5=0,\"\",VLOOKUP($AA5,'Absolutní-BODY'!$E$2:$O$161,6,FALSE))","v":""},{"$f":"IF($AA5=0,\"\",VLOOKUP($AA5,'Absolutní-BODY'!$E$2:$O$161,7,FALSE))","v":""},{"$f":"IF($AA5=0,\"\",VLOOKUP($AA5,'Absolutní-BODY'!$E$2:$O$161,8,FALSE))","v":""},{"$f":"IF($AA5=0,\"\",VLOOKUP($AA5,'Absolutní-BODY'!$E$2:$O$161,9,FALSE))","v":""},{"$f":"IF($AA5=0,\"\",VLOOKUP($AA5,'Absolutní-BODY'!$E$2:$O$161,10,FALSE))","v":""},{"$f":"IF($AA5=0,\"\",VLOOKUP($AA5,'Absolutní-BODY'!$E$2:$O$161,11,FALSE))","v":""}]
[2,{"$f":"IF(C6=0,\"\",VLOOKUP($C6,seznam!$A$1:$E$5058,2,FALSE))","v":""},null,{"$f":"IF($C6=0,\"\",VLOOKUP($C6,'Absolutní-BODY'!$E$2:$O$161,4,FALSE))","v":""},{"$f":"IF($C6=0,\"\",VLOOKUP($C6,'Absolutní-BODY'!$E$2:$O$161,5,FALSE))","v":""},{"$f":"IF($C6=0,\"\",VLOOKUP($C6,'Absolutní-BODY'!$E$2:$O$161,6,FALSE))","v":""},{"$f":"IF($C6=0,\"\",VLOOKUP($C6,'Absolutní-BODY'!$E$2:$O$161,7,FALSE))","v":""},{"$f":"IF($C6=0,\"\",VLOOKUP($C6,'Absolutní-BODY'!$E$2:$O$161,8,FALSE))","v":""},{"$f":"IF($C6=0,\"\",VLOOKUP($C6,'Absolutní-BODY'!$E$2:$O$161,9,FALSE))","v":""},{"$f":"IF($C6=0,\"\",VLOOKUP($C6,'Absolutní-BODY'!$E$2:$O$161,10,FALSE))","v":""},{"$f":"IF($C6=0,\"\",VLOOKUP($C6,'Absolutní-BODY'!$E$2:$O$161,11,FALSE))","v":""},null,2,{"$f":"IF(O6=0,\"\",VLOOKUP($O6,seznam!$A$1:$E$5058,2,FALSE))","v":""},null,{"$f":"IF($O6=0,\"\",VLOOKUP($O6,'Absolutní-BODY'!$E$2:$O$161,4,FALSE))","v":""},{"$f":"IF($O6=0,\"\",VLOOKUP($O6,'Absolutní-BODY'!$E$2:$O$161,5,FALSE))","v":""},{"$f":"IF($O6=0,\"\",VLOOKUP($O6,'Absolutní-BODY'!$E$2:$O$161,6,FALSE))","v":""},{"$f":"IF($O6=0,\"\",VLOOKUP($O6,'Absolutní-BODY'!$E$2:$O$161,7,FALSE))","v":""},{"$f":"IF($O6=0,\"\",VLOOKUP($O6,'Absolutní-BODY'!$E$2:$O$161,8,FALSE))","v":""},{"$f":"IF($O6=0,\"\",VLOOKUP($O6,'Absolutní-BODY'!$E$2:$O$161,9,FALSE))","v":""},{"$f":"IF($O6=0,\"\",VLOOKUP($O6,'Absolutní-BODY'!$E$2:$O$161,10,FALSE))","v":""},{"$f":"IF($O6=0,\"\",VLOOKUP($O6,'Absolutní-BODY'!$E$2:$O$161,11,FALSE))","v":""},null,2,{"$f":"IF(AA6=0,\"\",VLOOKUP($AA6,seznam!$A$1:$E$5058,2,FALSE))","v":""},null,{"$f":"IF($AA6=0,\"\",VLOOKUP($AA6,'Absolutní-BODY'!$E$2:$O$161,4,FALSE))","v":""},{"$f":"IF($AA6=0,\"\",VLOOKUP($AA6,'Absolutní-BODY'!$E$2:$O$161,5,FALSE))","v":""},{"$f":"IF($AA6=0,\"\",VLOOKUP($AA6,'Absolutní-BODY'!$E$2:$O$161,6,FALSE))","v":""},{"$f":"IF($AA6=0,\"\",VLOOKUP($AA6,'Absolutní-BODY'!$E$2:$O$161,7,FALSE))","v":""},{"$f":"IF($AA6=0,\"\",VLOOKUP($AA6,'Absolutní-BODY'!$E$2:$O$161,8,FALSE))","v":""},{"$f":"IF($AA6=0,\"\",VLOOKUP($AA6,'Absolutní-BODY'!$E$2:$O$161,9,FALSE))","v":""},{"$f":"IF($AA6=0,\"\",VLOOKUP($AA6,'Absolutní-BODY'!$E$2:$O$161,10,FALSE))","v":""},{"$f":"IF($AA6=0,\"\",VLOOKUP($AA6,'Absolutní-BODY'!$E$2:$O$161,11,FALSE))","v":""}]
[3,{"$f":"IF(C7=0,\"\",VLOOKUP($C7,seznam!$A$1:$E$5058,2,FALSE))","v":""},null,{"$f":"IF($C7=0,\"\",VLOOKUP($C7,'Absolutní-BODY'!$E$2:$O$161,4,FALSE))","v":""},{"$f":"IF($C7=0,\"\",VLOOKUP($C7,'Absolutní-BODY'!$E$2:$O$161,5,FALSE))","v":""},{"$f":"IF($C7=0,\"\",VLOOKUP($C7,'Absolutní-BODY'!$E$2:$O$161,6,FALSE))","v":""},{"$f":"IF($C7=0,\"\",VLOOKUP($C7,'Absolutní-BODY'!$E$2:$O$161,7,FALSE))","v":""},{"$f":"IF($C7=0,\"\",VLOOKUP($C7,'Absolutní-BODY'!$E$2:$O$161,8,FALSE))","v":""},{"$f":"IF($C7=0,\"\",VLOOKUP($C7,'Absolutní-BODY'!$E$2:$O$161,9,FALSE))","v":""},{"$f":"IF($C7=0,\"\",VLOOKUP($C7,'Absolutní-BODY'!$E$2:$O$161,10,FALSE))","v":""},{"$f":"IF($C7=0,\"\",VLOOKUP($C7,'Absolutní-BODY'!$E$2:$O$161,11,FALSE))","v":""},null,3,{"$f":"IF(O7=0,\"\",VLOOKUP($O7,seznam!$A$1:$E$5058,2,FALSE))","v":""},null,{"$f":"IF($O7=0,\"\",VLOOKUP($O7,'Absolutní-BODY'!$E$2:$O$161,4,FALSE))","v":""},{"$f":"IF($O7=0,\"\",VLOOKUP($O7,'Absolutní-BODY'!$E$2:$O$161,5,FALSE))","v":""},{"$f":"IF($O7=0,\"\",VLOOKUP($O7,'Absolutní-BODY'!$E$2:$O$161,6,FALSE))","v":""},{"$f":"IF($O7=0,\"\",VLOOKUP($O7,'Absolutní-BODY'!$E$2:$O$161,7,FALSE))","v":""},{"$f":"IF($O7=0,\"\",VLOOKUP($O7,'Absolutní-BODY'!$E$2:$O$161,8,FALSE))","v":""},{"$f":"IF($O7=0,\"\",VLOOKUP($O7,'Absolutní-BODY'!$E$2:$O$161,9,FALSE))","v":""},{"$f":"IF($O7=0,\"\",VLOOKUP($O7,'Absolutní-BODY'!$E$2:$O$161,10,FALSE))","v":""},{"$f":"IF($O7=0,\"\",VLOOKUP($O7,'Absolutní-BODY'!$E$2:$O$161,11,FALSE))","v":""},null,3,{"$f":"IF(AA7=0,\"\",VLOOKUP($AA7,seznam!$A$1:$E$5058,2,FALSE))","v":""},null,{"$f":"IF($AA7=0,\"\",VLOOKUP($AA7,'Absolutní-BODY'!$E$2:$O$161,4,FALSE))","v":""},{"$f":"IF($AA7=0,\"\",VLOOKUP($AA7,'Absolutní-BODY'!$E$2:$O$161,5,FALSE))","v":""},{"$f":"IF($AA7=0,\"\",VLOOKUP($AA7,'Absolutní-BODY'!$E$2:$O$161,6,FALSE))","v":""},{"$f":"IF($AA7=0,\"\",VLOOKUP($AA7,'Absolutní-BODY'!$E$2:$O$161,7,FALSE))","v":""},{"$f":"IF($AA7=0,\"\",VLOOKUP($AA7,'Absolutní-BODY'!$E$2:$O$161,8,FALSE))","v":""},{"$f":"IF($AA7=0,\"\",VLOOKUP($AA7,'Absolutní-BODY'!$E$2:$O$161,9,FALSE))","v":""},{"$f":"IF($AA7=0,\"\",VLOOKUP($AA7,'Absolutní-BODY'!$E$2:$O$161,10,FALSE))","v":""},{"$f":"IF($AA7=0,\"\",VLOOKUP($AA7,'Absolutní-BODY'!$E$2:$O$161,11,FALSE))","v":""}]
["N",{"$f":"IF(C8=0,\"\",VLOOKUP($C8,seznam!$A$1:$E$5058,2,FALSE))","v":""},null,{"$f":"IF($C8=0,\"\",VLOOKUP($C8,'Absolutní-BODY'!$E$2:$O$161,4,FALSE))","v":""},{"$f":"IF($C8=0,\"\",VLOOKUP($C8,'Absolutní-BODY'!$E$2:$O$161,5,FALSE))","v":""},{"$f":"IF($C8=0,\"\",VLOOKUP($C8,'Absolutní-BODY'!$E$2:$O$161,6,FALSE))","v":""},{"$f":"IF($C8=0,\"\",VLOOKUP($C8,'Absolutní-BODY'!$E$2:$O$161,7,FALSE))","v":""},{"$f":"IF($C8=0,\"\",VLOOKUP($C8,'Absolutní-BODY'!$E$2:$O$161,8,FALSE))","v":""},{"$f":"IF($C8=0,\"\",VLOOKUP($C8,'Absolutní-BODY'!$E$2:$O$161,9,FALSE))","v":""},{"$f":"IF($C8=0,\"\",VLOOKUP($C8,'Absolutní-BODY'!$E$2:$O$161,10,FALSE))","v":""},{"$f":"IF($C8=0,\"\",VLOOKUP($C8,'Absolutní-BODY'!$E$2:$O$161,11,FALSE))","v":""},null,"N",{"$f":"IF(O8=0,\"\",VLOOKUP($O8,seznam!$A$1:$E$5058,2,FALSE))","v":""},null,{"$f":"IF($O8=0,\"\",VLOOKUP($O8,'Absolutní-BODY'!$E$2:$O$161,4,FALSE))","v":""},{"$f":"IF($O8=0,\"\",VLOOKUP($O8,'Absolutní-BODY'!$E$2:$O$161,5,FALSE))","v":""},{"$f":"IF($O8=0,\"\",VLOOKUP($O8,'Absolutní-BODY'!$E$2:$O$161,6,FALSE))","v":""},{"$f":"IF($O8=0,\"\",VLOOKUP($O8,'Absolutní-BODY'!$E$2:$O$161,7,FALSE))","v":""},{"$f":"IF($O8=0,\"\",VLOOKUP($O8,'Absolutní-BODY'!$E$2:$O$161,8,FALSE))","v":""},{"$f":"IF($O8=0,\"\",VLOOKUP($O8,'Absolutní-BODY'!$E$2:$O$161,9,FALSE))","v":""},{"$f":"IF($O8=0,\"\",VLOOKUP($O8,'Absolutní-BODY'!$E$2:$O$161,10,FALSE))","v":""},{"$f":"IF($O8=0,\"\",VLOOKUP($O8,'Absolutní-BODY'!$E$2:$O$161,11,FALSE))","v":""},null,"N",{"$f":"IF(AA8=0,\"\",VLOOKUP($AA8,seznam!$A$1:$E$5058,2,FALSE))","v":""},null,{"$f":"IF($AA8=0,\"\",VLOOKUP($AA8,'Absolutní-BODY'!$E$2:$O$161,4,FALSE))","v":""},{"$f":"IF($AA8=0,\"\",VLOOKUP($AA8,'Absolutní-BODY'!$E$2:$O$161,5,FALSE))","v":""},{"$f":"IF($AA8=0,\"\",VLOOKUP($AA8,'Absolutní-BODY'!$E$2:$O$161,6,FALSE))","v":""},{"$f":"IF($AA8=0,\"\",VLOOKUP($AA8,'Absolutní-BODY'!$E$2:$O$161,7,FALSE))","v":""},{"$f":"IF($AA8=0,\"\",VLOOKUP($AA8,'Absolutní-BODY'!$E$2:$O$161,8,FALSE))","v":""},{"$f":"IF($AA8=0,\"\",VLOOKUP($AA8,'Absolutní-BODY'!$E$2:$O$161,9,FALSE))","v":""},{"$f":"IF($AA8=0,\"\",VLOOKUP($AA8,'Absolutní-BODY'!$E$2:$O$161,10,FALSE))","v":""},{"$f":"IF($AA8=0,\"\",VLOOKUP($AA8,'Absolutní-BODY'!$E$2:$O$161,11,FALSE))","v":""}]
[null,null,null,{"$f":"SUM(D5:D8)","v":0},0,0,0,0,0,0,0,null,null,null,null,{"$f":"SUM(P5:P8)","v":0},0,0,0,0,0,0,0,null,null,null,null,{"$f":"SUM(AB5:AB8)","v":0},0,0,0,0,0,0,0]
[null,null,"bodů",null,null,null,null,"celkem  ",null,{"$f":"SUM(D9:K9)","v":0},null,null,null,null,"bodů",null,null,null,null,"celkem  ",null,{"$f":"SUM(P9:W9)","v":0},null,null,null,null,"bodů",null,null,null,null,"celkem  ",null,{"$f":"SUM(AB9:AI9)","v":0}]
[]
[null,"4. místo",null,null,null,null,null,null,null,null,null,null,null,"5. místo",null,null,null,null,null,null,null,null,null,null,null,"6. místo"]
[null,null,"reg",1,2,3,4,5,6,7,8,null,null,null,"reg",1,2,3,4,5,6,7,8,null,null,null,"reg",1,2,3,4,5,6,7,8]
[1,{"$f":"IF(C14=0,\"\",VLOOKUP($C14,seznam!$A$1:$E$5058,2,FALSE))","v":""},null,{"$f":"IF($C14=0,\"\",VLOOKUP($C14,'Absolutní-BODY'!$E$2:$O$161,4,FALSE))","v":""},{"$f":"IF($C14=0,\"\",VLOOKUP($C14,'Absolutní-BODY'!$E$2:$O$161,5,FALSE))","v":""},{"$f":"IF($C14=0,\"\",VLOOKUP($C14,'Absolutní-BODY'!$E$2:$O$161,6,FALSE))","v":""},{"$f":"IF($C14=0,\"\",VLOOKUP($C14,'Absolutní-BODY'!$E$2:$O$161,7,FALSE))","v":""},{"$f":"IF($C14=0,\"\",VLOOKUP($C14,'Absolutní-BODY'!$E$2:$O$161,8,FALSE))","v":""},{"$f":"IF($C14=0,\"\",VLOOKUP($C14,'Absolutní-BODY'!$E$2:$O$161,9,FALSE))","v":""},{"$f":"IF($C14=0,\"\",VLOOKUP($C14,'Absolutní-BODY'!$E$2:$O$161,10,FALSE))","v":""},{"$f":"IF($C14=0,\"\",VLOOKUP($C14,'Absolutní-BODY'!$E$2:$O$161,11,FALSE))","v":""},null,1,{"$f":"IF(O14=0,\"\",VLOOKUP($O14,seznam!$A$1:$E$5058,2,FALSE))","v":""},null,{"$f":"IF($O14=0,\"\",VLOOKUP($O14,'Absolutní-BODY'!$E$2:$O$161,4,FALSE))","v":""},{"$f":"IF($O14=0,\"\",VLOOKUP($O14,'Absolutní-BODY'!$E$2:$O$161,5,FALSE))","v":""},{"$f":"IF($O14=0,\"\",VLOOKUP($O14,'Absolutní-BODY'!$E$2:$O$161,6,FALSE))","v":""},{"$f":"IF($O14=0,\"\",VLOOKUP($O14,'Absolutní-BODY'!$E$2:$O$161,7,FALSE))","v":""},{"$f":"IF($O14=0,\"\",VLOOKUP($O14,'Absolutní-BODY'!$E$2:$O$161,8,FALSE))","v":""},{"$f":"IF($O14=0,\"\",VLOOKUP($O14,'Absolutní-BODY'!$E$2:$O$161,9,FALSE))","v":""},{"$f":"IF($O14=0,\"\",VLOOKUP($O14,'Absolutní-BODY'!$E$2:$O$161,10,FALSE))","v":""},{"$f":"IF($O14=0,\"\",VLOOKUP($O14,'Absolutní-BODY'!$E$2:$O$161,11,FALSE))","v":""},null,1,{"$f":"IF(AA14=0,\"\",VLOOKUP($AA14,seznam!$A$1:$E$5058,2,FALSE))","v":""},null,{"$f":"IF($AA14=0,\"\",VLOOKUP($AA14,'Absolutní-BODY'!$E$2:$O$161,4,FALSE))","v":""},{"$f":"IF($AA14=0,\"\",VLOOKUP($AA14,'Absolutní-BODY'!$E$2:$O$161,5,FALSE))","v":""},{"$f":"IF($AA14=0,\"\",VLOOKUP($AA14,'Absolutní-BODY'!$E$2:$O$161,6,FALSE))","v":""},{"$f":"IF($AA14=0,\"\",VLOOKUP($AA14,'Absolutní-BODY'!$E$2:$O$161,7,FALSE))","v":""},{"$f":"IF($AA14=0,\"\",VLOOKUP($AA14,'Absolutní-BODY'!$E$2:$O$161,8,FALSE))","v":""},{"$f":"IF($AA14=0,\"\",VLOOKUP($AA14,'Absolutní-BODY'!$E$2:$O$161,9,FALSE))","v":""},{"$f":"IF($AA14=0,\"\",VLOOKUP($AA14,'Absolutní-BODY'!$E$2:$O$161,10,FALSE))","v":""},{"$f":"IF($AA14=0,\"\",VLOOKUP($AA14,'Absolutní-BODY'!$E$2:$O$161,11,FALSE))","v":""}]
[2,{"$f":"IF(C15=0,\"\",VLOOKUP($C15,seznam!$A$1:$E$5058,2,FALSE))","v":""},null,{"$f":"IF($C15=0,\"\",VLOOKUP($C15,'Absolutní-BODY'!$E$2:$O$161,4,FALSE))","v":""},{"$f":"IF($C15=0,\"\",VLOOKUP($C15,'Absolutní-BODY'!$E$2:$O$161,5,FALSE))","v":""},{"$f":"IF($C15=0,\"\",VLOOKUP($C15,'Absolutní-BODY'!$E$2:$O$161,6,FALSE))","v":""},{"$f":"IF($C15=0,\"\",VLOOKUP($C15,'Absolutní-BODY'!$E$2:$O$161,7,FALSE))","v":""},{"$f":"IF($C15=0,\"\",VLOOKUP($C15,'Absolutní-BODY'!$E$2:$O$161,8,FALSE))","v":""},{"$f":"IF($C15=0,\"\",VLOOKUP($C15,'Absolutní-BODY'!$E$2:$O$161,9,FALSE))","v":""},{"$f":"IF($C15=0,\"\",VLOOKUP($C15,'Absolutní-BODY'!$E$2:$O$161,10,FALSE))","v":""},{"$f":"IF($C15=0,\"\",VLOOKUP($C15,'Absolutní-BODY'!$E$2:$O$161,11,FALSE))","v":""},null,2,{"$f":"IF(O15=0,\"\",VLOOKUP($O15,seznam!$A$1:$E$5058,2,FALSE))","v":""},null,{"$f":"IF($O15=0,\"\",VLOOKUP($O15,'Absolutní-BODY'!$E$2:$O$161,4,FALSE))","v":""},{"$f":"IF($O15=0,\"\",VLOOKUP($O15,'Absolutní-BODY'!$E$2:$O$161,5,FALSE))","v":""},{"$f":"IF($O15=0,\"\",VLOOKUP($O15,'Absolutní-BODY'!$E$2:$O$161,6,FALSE))","v":""},{"$f":"IF($O15=0,\"\",VLOOKUP($O15,'Absolutní-BODY'!$E$2:$O$161,7,FALSE))","v":""},{"$f":"IF($O15=0,\"\",VLOOKUP($O15,'Absolutní-BODY'!$E$2:$O$161,8,FALSE))","v":""},{"$f":"IF($O15=0,\"\",VLOOKUP($O15,'Absolutní-BODY'!$E$2:$O$161,9,FALSE))","v":""},{"$f":"IF($O15=0,\"\",VLOOKUP($O15,'Absolutní-BODY'!$E$2:$O$161,10,FALSE))","v":""},{"$f":"IF($O15=0,\"\",VLOOKUP($O15,'Absolutní-BODY'!$E$2:$O$161,11,FALSE))","v":""},null,2,{"$f":"IF(AA15=0,\"\",VLOOKUP($AA15,seznam!$A$1:$E$5058,2,FALSE))","v":""},null,{"$f":"IF($AA15=0,\"\",VLOOKUP($AA15,'Absolutní-BODY'!$E$2:$O$161,4,FALSE))","v":""},{"$f":"IF($AA15=0,\"\",VLOOKUP($AA15,'Absolutní-BODY'!$E$2:$O$161,5,FALSE))","v":""},{"$f":"IF($AA15=0,\"\",VLOOKUP($AA15,'Absolutní-BODY'!$E$2:$O$161,6,FALSE))","v":""},{"$f":"IF($AA15=0,\"\",VLOOKUP($AA15,'Absolutní-BODY'!$E$2:$O$161,7,FALSE))","v":""},{"$f":"IF($AA15=0,\"\",VLOOKUP($AA15,'Absolutní-BODY'!$E$2:$O$161,8,FALSE))","v":""},{"$f":"IF($AA15=0,\"\",VLOOKUP($AA15,'Absolutní-BODY'!$E$2:$O$161,9,FALSE))","v":""},{"$f":"IF($AA15=0,\"\",VLOOKUP($AA15,'Absolutní-BODY'!$E$2:$O$161,10,FALSE))","v":""},{"$f":"IF($AA15=0,\"\",VLOOKUP($AA15,'Absolutní-BODY'!$E$2:$O$161,11,FALSE))","v":""}]
[3,{"$f":"IF(C16=0,\"\",VLOOKUP($C16,seznam!$A$1:$E$5058,2,FALSE))","v":""},null,{"$f":"IF($C16=0,\"\",VLOOKUP($C16,'Absolutní-BODY'!$E$2:$O$161,4,FALSE))","v":""},{"$f":"IF($C16=0,\"\",VLOOKUP($C16,'Absolutní-BODY'!$E$2:$O$161,5,FALSE))","v":""},{"$f":"IF($C16=0,\"\",VLOOKUP($C16,'Absolutní-BODY'!$E$2:$O$161,6,FALSE))","v":""},{"$f":"IF($C16=0,\"\",VLOOKUP($C16,'Absolutní-BODY'!$E$2:$O$161,7,FALSE))","v":""},{"$f":"IF($C16=0,\"\",VLOOKUP($C16,'Absolutní-BODY'!$E$2:$O$161,8,FALSE))","v":""},{"$f":"IF($C16=0,\"\",VLOOKUP($C16,'Absolutní-BODY'!$E$2:$O$161,9,FALSE))","v":""},{"$f":"IF($C16=0,\"\",VLOOKUP($C16,'Absolutní-BODY'!$E$2:$O$161,10,FALSE))","v":""},{"$f":"IF($C16=0,\"\",VLOOKUP($C16,'Absolutní-BODY'!$E$2:$O$161,11,FALSE))","v":""},null,3,{"$f":"IF(O16=0,\"\",VLOOKUP($O16,seznam!$A$1:$E$5058,2,FALSE))","v":""},null,{"$f":"IF($O16=0,\"\",VLOOKUP($O16,'Absolutní-BODY'!$E$2:$O$161,4,FALSE))","v":""},{"$f":"IF($O16=0,\"\",VLOOKUP($O16,'Absolutní-BODY'!$E$2:$O$161,5,FALSE))","v":""},{"$f":"IF($O16=0,\"\",VLOOKUP($O16,'Absolutní-BODY'!$E$2:$O$161,6,FALSE))","v":""},{"$f":"IF($O16=0,\"\",VLOOKUP($O16,'Absolutní-BODY'!$E$2:$O$161,7,FALSE))","v":""},{"$f":"IF($O16=0,\"\",VLOOKUP($O16,'Absolutní-BODY'!$E$2:$O$161,8,FALSE))","v":""},{"$f":"IF($O16=0,\"\",VLOOKUP($O16,'Absolutní-BODY'!$E$2:$O$161,9,FALSE))","v":""},{"$f":"IF($O16=0,\"\",VLOOKUP($O16,'Absolutní-BODY'!$E$2:$O$161,10,FALSE))","v":""},{"$f":"IF($O16=0,\"\",VLOOKUP($O16,'Absolutní-BODY'!$E$2:$O$161,11,FALSE))","v":""},null,3,{"$f":"IF(AA16=0,\"\",VLOOKUP($AA16,seznam!$A$1:$E$5058,2,FALSE))","v":""},null,{"$f":"IF($AA16=0,\"\",VLOOKUP($AA16,'Absolutní-BODY'!$E$2:$O$161,4,FALSE))","v":""},{"$f":"IF($AA16=0,\"\",VLOOKUP($AA16,'Absolutní-BODY'!$E$2:$O$161,5,FALSE))","v":""},{"$f":"IF($AA16=0,\"\",VLOOKUP($AA16,'Absolutní-BODY'!$E$2:$O$161,6,FALSE))","v":""},{"$f":"IF($AA16=0,\"\",VLOOKUP($AA16,'Absolutní-BODY'!$E$2:$O$161,7,FALSE))","v":""},{"$f":"IF($AA16=0,\"\",VLOOKUP($AA16,'Absolutní-BODY'!$E$2:$O$161,8,FALSE))","v":""},{"$f":"IF($AA16=0,\"\",VLOOKUP($AA16,'Absolutní-BODY'!$E$2:$O$161,9,FALSE))","v":""},{"$f":"IF($AA16=0,\"\",VLOOKUP($AA16,'Absolutní-BODY'!$E$2:$O$161,10,FALSE))","v":""},{"$f":"IF($AA16=0,\"\",VLOOKUP($AA16,'Absolutní-BODY'!$E$2:$O$161,11,FALSE))","v":""}]
["N",{"$f":"IF(C17=0,\"\",VLOOKUP($C17,seznam!$A$1:$E$5058,2,FALSE))","v":""},null,{"$f":"IF($C17=0,\"\",VLOOKUP($C17,'Absolutní-BODY'!$E$2:$O$161,4,FALSE))","v":""},{"$f":"IF($C17=0,\"\",VLOOKUP($C17,'Absolutní-BODY'!$E$2:$O$161,5,FALSE))","v":""},{"$f":"IF($C17=0,\"\",VLOOKUP($C17,'Absolutní-BODY'!$E$2:$O$161,6,FALSE))","v":""},{"$f":"IF($C17=0,\"\",VLOOKUP($C17,'Absolutní-BODY'!$E$2:$O$161,7,FALSE))","v":""},{"$f":"IF($C17=0,\"\",VLOOKUP($C17,'Absolutní-BODY'!$E$2:$O$161,8,FALSE))","v":""},{"$f":"IF($C17=0,\"\",VLOOKUP($C17,'Absolutní-BODY'!$E$2:$O$161,9,FALSE))","v":""},{"$f":"IF($C17=0,\"\",VLOOKUP($C17,'Absolutní-BODY'!$E$2:$O$161,10,FALSE))","v":""},{"$f":"IF($C17=0,\"\",VLOOKUP($C17,'Absolutní-BODY'!$E$2:$O$161,11,FALSE))","v":""},null,"N",{"$f":"IF(O17=0,\"\",VLOOKUP($O17,seznam!$A$1:$E$5058,2,FALSE))","v":""},null,{"$f":"IF($O17=0,\"\",VLOOKUP($O17,'Absolutní-BODY'!$E$2:$O$161,4,FALSE))","v":""},{"$f":"IF($O17=0,\"\",VLOOKUP($O17,'Absolutní-BODY'!$E$2:$O$161,5,FALSE))","v":""},{"$f":"IF($O17=0,\"\",VLOOKUP($O17,'Absolutní-BODY'!$E$2:$O$161,6,FALSE))","v":""},{"$f":"IF($O17=0,\"\",VLOOKUP($O17,'Absolutní-BODY'!$E$2:$O$161,7,FALSE))","v":""},{"$f":"IF($O17=0,\"\",VLOOKUP($O17,'Absolutní-BODY'!$E$2:$O$161,8,FALSE))","v":""},{"$f":"IF($O17=0,\"\",VLOOKUP($O17,'Absolutní-BODY'!$E$2:$O$161,9,FALSE))","v":""},{"$f":"IF($O17=0,\"\",VLOOKUP($O17,'Absolutní-BODY'!$E$2:$O$161,10,FALSE))","v":""},{"$f":"IF($O17=0,\"\",VLOOKUP($O17,'Absolutní-BODY'!$E$2:$O$161,11,FALSE))","v":""},null,"N",{"$f":"IF(AA17=0,\"\",VLOOKUP($AA17,seznam!$A$1:$E$5058,2,FALSE))","v":""},null,{"$f":"IF($AA17=0,\"\",VLOOKUP($AA17,'Absolutní-BODY'!$E$2:$O$161,4,FALSE))","v":""},{"$f":"IF($AA17=0,\"\",VLOOKUP($AA17,'Absolutní-BODY'!$E$2:$O$161,5,FALSE))","v":""},{"$f":"IF($AA17=0,\"\",VLOOKUP($AA17,'Absolutní-BODY'!$E$2:$O$161,6,FALSE))","v":""},{"$f":"IF($AA17=0,\"\",VLOOKUP($AA17,'Absolutní-BODY'!$E$2:$O$161,7,FALSE))","v":""},{"$f":"IF($AA17=0,\"\",VLOOKUP($AA17,'Absolutní-BODY'!$E$2:$O$161,8,FALSE))","v":""},{"$f":"IF($AA17=0,\"\",VLOOKUP($AA17,'Absolutní-BODY'!$E$2:$O$161,9,FALSE))","v":""},{"$f":"IF($AA17=0,\"\",VLOOKUP($AA17,'Absolutní-BODY'!$E$2:$O$161,10,FALSE))","v":""},{"$f":"IF($AA17=0,\"\",VLOOKUP($AA17,'Absolutní-BODY'!$E$2:$O$161,11,FALSE))","v":""}]
[null,null,null,{"$f":"SUM(D14:D17)","v":0},0,0,0,0,0,0,0,null,null,null,null,{"$f":"SUM(P14:P17)","v":0},0,0,0,0,0,0,0,null,null,null,null,{"$f":"SUM(AB14:AB17)","v":0},0,0,0,0,0,0,0]
[null,null,"bodů",null,null,null,null,"celkem  ",null,{"$f":"SUM(D18:K18)","v":0},null,null,null,null,"bodů",null,null,null,null,"celkem  ",null,{"$f":"SUM(P18:W18)","v":0},null,null,null,null,"bodů",null,null,null,null,"celkem  ",null,{"$f":"SUM(AB18:AI18)","v":0}]
[]
[null,"7. místo",null,null,null,null,null,null,null,null,null,null,null,"8. místo"]
[null,null,"reg",1,2,3,4,5,6,7,8,null,null,null,"reg",1,2,3,4,5,6,7,8]
[1,{"$f":"IF(C23=0,\"\",VLOOKUP($C23,seznam!$A$1:$E$5058,2,FALSE))","v":""},null,{"$f":"IF($C23=0,\"\",VLOOKUP($C23,'Absolutní-BODY'!$E$2:$O$161,4,FALSE))","v":""},{"$f":"IF($C23=0,\"\",VLOOKUP($C23,'Absolutní-BODY'!$E$2:$O$161,5,FALSE))","v":""},{"$f":"IF($C23=0,\"\",VLOOKUP($C23,'Absolutní-BODY'!$E$2:$O$161,6,FALSE))","v":""},{"$f":"IF($C23=0,\"\",VLOOKUP($C23,'Absolutní-BODY'!$E$2:$O$161,7,FALSE))","v":""},{"$f":"IF($C23=0,\"\",VLOOKUP($C23,'Absolutní-BODY'!$E$2:$O$161,8,FALSE))","v":""},{"$f":"IF($C23=0,\"\",VLOOKUP($C23,'Absolutní-BODY'!$E$2:$O$161,9,FALSE))","v":""},{"$f":"IF($C23=0,\"\",VLOOKUP($C23,'Absolutní-BODY'!$E$2:$O$161,10,FALSE))","v":""},{"$f":"IF($C23=0,\"\",VLOOKUP($C23,'Absolutní-BODY'!$E$2:$O$161,11,FALSE))","v":""},null,1,{"$f":"IF(O23=0,\"\",VLOOKUP($O23,seznam!$A$1:$E$5058,2,FALSE))","v":""},null,{"$f":"IF($O23=0,\"\",VLOOKUP($O23,'Absolutní-BODY'!$E$2:$O$161,4,FALSE))","v":""},{"$f":"IF($O23=0,\"\",VLOOKUP($O23,'Absolutní-BODY'!$E$2:$O$161,5,FALSE))","v":""},{"$f":"IF($O23=0,\"\",VLOOKUP($O23,'Absolutní-BODY'!$E$2:$O$161,6,FALSE))","v":""},{"$f":"IF($O23=0,\"\",VLOOKUP($O23,'Absolutní-BODY'!$E$2:$O$161,7,FALSE))","v":""},{"$f":"IF($O23=0,\"\",VLOOKUP($O23,'Absolutní-BODY'!$E$2:$O$161,8,FALSE))","v":""},{"$f":"IF($O23=0,\"\",VLOOKUP($O23,'Absolutní-BODY'!$E$2:$O$161,9,FALSE))","v":""},{"$f":"IF($O23=0,\"\",VLOOKUP($O23,'Absolutní-BODY'!$E$2:$O$161,10,FALSE))","v":""},{"$f":"IF($O23=0,\"\",VLOOKUP($O23,'Absolutní-BODY'!$E$2:$O$161,11,FALSE))","v":""}]
[2,{"$f":"IF(C24=0,\"\",VLOOKUP($C24,seznam!$A$1:$E$5058,2,FALSE))","v":""},null,{"$f":"IF($C24=0,\"\",VLOOKUP($C24,'Absolutní-BODY'!$E$2:$O$161,4,FALSE))","v":""},{"$f":"IF($C24=0,\"\",VLOOKUP($C24,'Absolutní-BODY'!$E$2:$O$161,5,FALSE))","v":""},{"$f":"IF($C24=0,\"\",VLOOKUP($C24,'Absolutní-BODY'!$E$2:$O$161,6,FALSE))","v":""},{"$f":"IF($C24=0,\"\",VLOOKUP($C24,'Absolutní-BODY'!$E$2:$O$161,7,FALSE))","v":""},{"$f":"IF($C24=0,\"\",VLOOKUP($C24,'Absolutní-BODY'!$E$2:$O$161,8,FALSE))","v":""},{"$f":"IF($C24=0,\"\",VLOOKUP($C24,'Absolutní-BODY'!$E$2:$O$161,9,FALSE))","v":""},{"$f":"IF($C24=0,\"\",VLOOKUP($C24,'Absolutní-BODY'!$E$2:$O$161,10,FALSE))","v":""},{"$f":"IF($C24=0,\"\",VLOOKUP($C24,'Absolutní-BODY'!$E$2:$O$161,11,FALSE))","v":""},null,2,{"$f":"IF(O24=0,\"\",VLOOKUP($O24,seznam!$A$1:$E$5058,2,FALSE))","v":""},null,{"$f":"IF($O24=0,\"\",VLOOKUP($O24,'Absolutní-BODY'!$E$2:$O$161,4,FALSE))","v":""},{"$f":"IF($O24=0,\"\",VLOOKUP($O24,'Absolutní-BODY'!$E$2:$O$161,5,FALSE))","v":""},{"$f":"IF($O24=0,\"\",VLOOKUP($O24,'Absolutní-BODY'!$E$2:$O$161,6,FALSE))","v":""},{"$f":"IF($O24=0,\"\",VLOOKUP($O24,'Absolutní-BODY'!$E$2:$O$161,7,FALSE))","v":""},{"$f":"IF($O24=0,\"\",VLOOKUP($O24,'Absolutní-BODY'!$E$2:$O$161,8,FALSE))","v":""},{"$f":"IF($O24=0,\"\",VLOOKUP($O24,'Absolutní-BODY'!$E$2:$O$161,9,FALSE))","v":""},{"$f":"IF($O24=0,\"\",VLOOKUP($O24,'Absolutní-BODY'!$E$2:$O$161,10,FALSE))","v":""},{"$f":"IF($O24=0,\"\",VLOOKUP($O24,'Absolutní-BODY'!$E$2:$O$161,11,FALSE))","v":""}]
[3,{"$f":"IF(C25=0,\"\",VLOOKUP($C25,seznam!$A$1:$E$5058,2,FALSE))","v":""},null,{"$f":"IF($C25=0,\"\",VLOOKUP($C25,'Absolutní-BODY'!$E$2:$O$161,4,FALSE))","v":""},{"$f":"IF($C25=0,\"\",VLOOKUP($C25,'Absolutní-BODY'!$E$2:$O$161,5,FALSE))","v":""},{"$f":"IF($C25=0,\"\",VLOOKUP($C25,'Absolutní-BODY'!$E$2:$O$161,6,FALSE))","v":""},{"$f":"IF($C25=0,\"\",VLOOKUP($C25,'Absolutní-BODY'!$E$2:$O$161,7,FALSE))","v":""},{"$f":"IF($C25=0,\"\",VLOOKUP($C25,'Absolutní-BODY'!$E$2:$O$161,8,FALSE))","v":""},{"$f":"IF($C25=0,\"\",VLOOKUP($C25,'Absolutní-BODY'!$E$2:$O$161,9,FALSE))","v":""},{"$f":"IF($C25=0,\"\",VLOOKUP($C25,'Absolutní-BODY'!$E$2:$O$161,10,FALSE))","v":""},{"$f":"IF($C25=0,\"\",VLOOKUP($C25,'Absolutní-BODY'!$E$2:$O$161,11,FALSE))","v":""},null,3,{"$f":"IF(O25=0,\"\",VLOOKUP($O25,seznam!$A$1:$E$5058,2,FALSE))","v":""},null,{"$f":"IF($O25=0,\"\",VLOOKUP($O25,'Absolutní-BODY'!$E$2:$O$161,4,FALSE))","v":""},{"$f":"IF($O25=0,\"\",VLOOKUP($O25,'Absolutní-BODY'!$E$2:$O$161,5,FALSE))","v":""},{"$f":"IF($O25=0,\"\",VLOOKUP($O25,'Absolutní-BODY'!$E$2:$O$161,6,FALSE))","v":""},{"$f":"IF($O25=0,\"\",VLOOKUP($O25,'Absolutní-BODY'!$E$2:$O$161,7,FALSE))","v":""},{"$f":"IF($O25=0,\"\",VLOOKUP($O25,'Absolutní-BODY'!$E$2:$O$161,8,FALSE))","v":""},{"$f":"IF($O25=0,\"\",VLOOKUP($O25,'Absolutní-BODY'!$E$2:$O$161,9,FALSE))","v":""},{"$f":"IF($O25=0,\"\",VLOOKUP($O25,'Absolutní-BODY'!$E$2:$O$161,10,FALSE))","v":""},{"$f":"IF($O25=0,\"\",VLOOKUP($O25,'Absolutní-BODY'!$E$2:$O$161,11,FALSE))","v":""}]
["N",{"$f":"IF(C26=0,\"\",VLOOKUP($C26,seznam!$A$1:$E$5058,2,FALSE))","v":""},null,{"$f":"IF($C26=0,\"\",VLOOKUP($C26,'Absolutní-BODY'!$E$2:$O$161,4,FALSE))","v":""},{"$f":"IF($C26=0,\"\",VLOOKUP($C26,'Absolutní-BODY'!$E$2:$O$161,5,FALSE))","v":""},{"$f":"IF($C26=0,\"\",VLOOKUP($C26,'Absolutní-BODY'!$E$2:$O$161,6,FALSE))","v":""},{"$f":"IF($C26=0,\"\",VLOOKUP($C26,'Absolutní-BODY'!$E$2:$O$161,7,FALSE))","v":""},{"$f":"IF($C26=0,\"\",VLOOKUP($C26,'Absolutní-BODY'!$E$2:$O$161,8,FALSE))","v":""},{"$f":"IF($C26=0,\"\",VLOOKUP($C26,'Absolutní-BODY'!$E$2:$O$161,9,FALSE))","v":""},{"$f":"IF($C26=0,\"\",VLOOKUP($C26,'Absolutní-BODY'!$E$2:$O$161,10,FALSE))","v":""},{"$f":"IF($C26=0,\"\",VLOOKUP($C26,'Absolutní-BODY'!$E$2:$O$161,11,FALSE))","v":""},null,"N",{"$f":"IF(O26=0,\"\",VLOOKUP($O26,seznam!$A$1:$E$5058,2,FALSE))","v":""},null,{"$f":"IF($O26=0,\"\",VLOOKUP($O26,'Absolutní-BODY'!$E$2:$O$161,4,FALSE))","v":""},{"$f":"IF($O26=0,\"\",VLOOKUP($O26,'Absolutní-BODY'!$E$2:$O$161,5,FALSE))","v":""},{"$f":"IF($O26=0,\"\",VLOOKUP($O26,'Absolutní-BODY'!$E$2:$O$161,6,FALSE))","v":""},{"$f":"IF($O26=0,\"\",VLOOKUP($O26,'Absolutní-BODY'!$E$2:$O$161,7,FALSE))","v":""},{"$f":"IF($O26=0,\"\",VLOOKUP($O26,'Absolutní-BODY'!$E$2:$O$161,8,FALSE))","v":""},{"$f":"IF($O26=0,\"\",VLOOKUP($O26,'Absolutní-BODY'!$E$2:$O$161,9,FALSE))","v":""},{"$f":"IF($O26=0,\"\",VLOOKUP($O26,'Absolutní-BODY'!$E$2:$O$161,10,FALSE))","v":""},{"$f":"IF($O26=0,\"\",VLOOKUP($O26,'Absolutní-BODY'!$E$2:$O$161,11,FALSE))","v":""}]
[null,null,null,{"$f":"SUM(D23:D26)","v":0},0,0,0,0,0,0,0,null,null,null,null,{"$f":"SUM(P23:P26)","v":0},0,0,0,0,0,0,0]
[null,null,"bodů",null,null,null,null,"celkem  ",null,{"$f":"SUM(D27:K27)","v":0},null,null,null,null,"bodů",null,null,null,null,"celkem  ",null,{"$f":"SUM(P27:W27)","v":0}]

{"sheet":"Liga-celkem","index":10,"n_rows":13,"n_cols":21,"rows_kept":13,"cut":false,"hidden":false,"merged":[[6,19,6,20],[6,17,6,18],[6,1,7,2],[4,1,5,2],[6,9,6,10],[5,3,5,6],[1,13,1,16],[1,5,1,6],[2,1,2,16],[6,3,6,4],[6,5,6,6],[6,7,6,8]]}
[]
["po",4,".kole",null,null,2,null,"liga družstev",null,null,null,null,null,"2012/2013"]
[]
[]
[null,"Celková tabulka"]
[null,null,null,2012,null,null,null,null,null,null,null,null,null,2013]
[null,"2. liga                                              smíšená družstva",null,"Jesenice 26.8.",null,"Rakovník 2.9.",null,"Rakovník 21.4.",null,"Chomutov 5.5",null,null,null,null,null,null,null,null,null,"Celkem:"]
[null,null,null,"údery","body","údery","body","údery","body","údery","body","údery","body","údery","body","údery","body","údery","body","údery","body"]
[null,"1.","SKGC Frant.Lázně \"A\"",388,6,408,4,422,6,411,6,null,null,null,null,null,null,null,null,1629,22]
[null,"2.","MGC Plzeň",398,4,381,6,432,4,420,3,null,null,null,null,null,null,null,null,1631,17]
[null,"3.","SKDG Chomutov",453,1,411,3,456,3,430,2,null,null,null,null,null,null,null,null,1750,9]
[null,"4.","SKGC Frant.Lázně \"B\"",437,2,419,2,494,1,415,4,null,null,null,null,null,null,null,null,1765,9]
[null,"5.","Varieté Jesenice",422,3,429,1,489,2,465,1,null,null,null,null,null,null,null,null,1805,7]

{"sheet":"typ turnaje","index":11,"n_rows":24,"n_cols":18,"rows_kept":24,"cut":false,"hidden":true,"merged":[[1,1,1,3],[22,10,22,14],[21,10,21,22],[22,16,22,22]]}
["Dotazovací tabulka",null,null,null,null,null,null,null,null,null,"Základní limity:"]
[null,"Co je to za turnaj ?",null,null,null,"p","B","k",null,null,null,"M",1,2,3,4,5," - "]
[null,1,"Open","mtg",null,{"$f":"IF($B3=1,6,0)","v":6},{"$f":"IF($B3=1,64,0)","v":64},{"$f":"IF($B3=1,0.25,0)","v":0.25},null,null,"M",550,450,350,250,150,1,0]
[null,null,"Open","mg",null,{"$f":"IF(B4=1,6,0)","v":0},0,{"$f":"IF($B4=1,0.3,0)","v":0},null,null,"Z",480,380,290,200,100,1,0]
[null,null,"Open","filc",null,{"$f":"IF(B5=1,6,0)","v":0},0,{"$f":"IF($B5=1,0.33,0)","v":0},null,null,"S",500,410,320,230,140,1,0]
[null,null,"KP","mtg",null,{"$f":"IF(B6=1,8,0)","v":0},0,{"$f":"IF($B6=1,0.25,0)","v":0},null,null,"Se",440,360,280,200,100,1,0]
[null,null,"KP","mg",null,0,0,{"$f":"IF($B7=1,0.3,0)","v":0},null,null,"S2",440,360,280,200,100,1,0]
[null,null,"KP","filc",null,0,0,{"$f":"IF($B8=1,0.33,0)","v":0},null,null,"J",520,420,320,220,120,1,0]
[null,null,"Tour","mtg",null,0,{"$f":"IF($B9=1,80,0)","v":0},{"$f":"IF($B9=1,0.15,0)","v":0},null,null,"Ju",480,380,290,200,100,1,0]
[null,null,"Tour","mg",null,0,0,{"$f":"IF($B10=1,0.18,0)","v":0},null,null,"Jz",420,330,240,150,90,1,0]
[null,null,"Tour","filc",null,0,0,{"$f":"IF($B11=1,0.2,0)","v":0},null,null,"Jza",360,280,200,130,70,1,0]
[null,null,"PZ","mtg",null,{"$f":"IF(B12=1,12,0)","v":0},0,{"$f":"IF($B12=1,0.15,0)","v":0}]
[null,null,"PZ","mg",null,{"$f":"IF(B13=1,12,0)","v":0},0,{"$f":"IF($B13=1,0.18,0)","v":0},null,null,"Přechod do jiné kategorie : "]
[null,null,"PZ","filc",null,{"$f":"IF(B14=1,12,0)","v":0},0,{"$f":"IF($B14=1,0.2,0)","v":0},null,null,null,"hráč získá VT podle limitu VT kategorie, do které přechází"]
[null,null,"CTM","mtg",null,{"$f":"IF(B15=1,8,0)","v":0},{"$f":"IF($B15=1,90,0)","v":0},{"$f":"IF($B15=1,0.16,0)","v":0}]
[null,null,"CTM","mg",null,{"$f":"IF(B16=1,8,0)","v":0},{"$f":"IF($B16=1,90,0)","v":0},{"$f":"IF($B16=1,0.19,0)","v":0},null,null,"Výjimky: "]
[null,null,"CTM","filc",null,{"$f":"IF(B17=1,8,0)","v":0},{"$f":"IF($B17=1,90,0)","v":0},{"$f":"IF($B17=1,0.21,0)","v":0},null,null,null,"medailista MR, JT který dosáhl limitu 1. VT a nižší, získává  VT o jeden stupeň vyšší "]
[null,null,"GP","mtg",null,{"$f":"IF(B18=1,12,0)","v":0},{"$f":"IF($B18=1,100,0)","v":0},{"$f":"IF($B18=1,0.08,0)","v":0},null,null,null,"medailista PZ který dosáhl limitu 2. VT a nižší, získává  VT o jeden stupeň vyšší"]
[null,null,"GP","mg",null,{"$f":"IF(B19=1,12,0)","v":0},{"$f":"IF($B19=1,100,0)","v":0},{"$f":"IF($B19=1,0.1,0)","v":0},null,null,null,"medailista KP který dosáhl limitu 3. VT a nižší, získává  VT o jeden stupeň vyšší"]
[null,null,"GP","filc",null,{"$f":"IF(B20=1,12,0)","v":0},{"$f":"IF($B20=1,100,0)","v":0},{"$f":"IF($B20=1,0.11,0)","v":0}]
[null,null,"MR","mtg",null,{"$f":"IF(B21=1,16,0)","v":0},{"$f":"IF($B21=1,110,0)","v":0},{"$f":"IF($B21=1,0.1,0)","v":0}]
[null,null,"MR","mtg+filc",null,{"$f":"IF(B22=1,16,0)","v":0},{"$f":"IF($B22=1,110,0)","v":0},{"$f":"IF($B22=1,0.12,0)","v":0},null,null,"Právě jen do typu turnaje, pro který děláte body,"]
[null,null,"MR","mtg+mg",null,{"$f":"IF(B23=1,16,0)","v":0},{"$f":"IF($B23=1,110,0)","v":0},{"$f":"IF($B23=1,0.11,0)","v":0},null,null," vepište prosím číslo",null,null,null,null,1,"Jinak to s Vámi nebude hrát."]
[null,{"$f":"SUM(B3:B23)","v":1},null,null,null,{"$f":"IF($B$24=1,SUM(F3:F23),0)","v":6},{"$f":"IF($B$24=1,SUM(G3:G23),0)","v":64},{"$f":"IF($B$24=1,SUM(H3:H23),0)","v":0.25}]

{"sheet":"seznam","index":12,"n_rows":3640,"n_cols":8,"rows_kept":3640,"cut":false,"hidden":true,"merged":[]}
["reg","jméno","oddíl","VT","kat",null,"aktualizace","2013-05-08"]
[1,"Boček Pavel st.","nezadán","bez","S2",1941]
[2,"Grebeníček Antonín","nezadán","bez","S2",1953]
[3,"Jiřikovský Miroslav","nezadán","bez","S2",1945]
[4,"Kalus Jaroslav","nezadán","bez","S2",1946]
[5,"Krásný Petr","nezadán","bez","S2",1947]
[6,"Ländler Egon","nezadán","bez","S2",1925]
[7,"Ländler Petr","nezadán","bez","S2",1948]
[8,"Pachl Zdeněk","nezadán","bez","S2",1921]
[9,"Pardus Jiří","nezadán","bez","S2",1952]
[10,"Pavlík Vladimír","nezadán","bez","S2",1951]
[11,"Procházka Ladislav","nezadán","bez","S2",1934]
[12,"Pupík Josef","nezadán","bez","S",1958]
[13,"Vaněk František","nezadán","bez","S2",1947]
[14,"Vařecha Pavel","nezadán","bez","S2",1949]
[15,"Vojtek Miroslav","nezadán","bez","S2",1948]
[16,"Zámečník Miroslav","nezadán","bez","S2",1943]
[17,"Zelinka Jan","nezadán","bez","S2",1920]
[18,"Zedek Vlastimil","nezadán","bez","S2",1928]
[19,"Zedek Jan","nezadán","bez","S",1955]
[20,"Bočková Eliška","nezadán","bez","Se",1943]
[21,"Kočíková Marie","nezadán","bez","Se",1943]
[22,"Kosinková Anna","nezadán","bez","Se",1936]
[23,"Pardusová Běla","nezadán","bez","Se",1951]
[24,"Pachl Miroslav","nezadán","bez","S",1962]
[25,"Tvrdoň Antonín","nezadán","bez","S",1960]
[26,"Vávrů Ivan","nezadán","bez","S",1960]
[27,"Boček Pavel ml.","nezadán","bez","S",1964]
[28,"Balaj Jozef","zahraniční klub","bez","S2",1951]
[29,"Bránsky Štefan","zahraniční klub","bez","S",1956]
[30,"Dobák Ivan","zahraniční klub","bez","S",1956]
[31,"Drgoň František","MGK Adara Radějov","bez","S",1960]
[32,"Ďuriník Ladislav","zahraniční klub","bez","S2",1948]
[33,"Gabriš Alojz","zahraniční klub","bez","S",1959]
[34,"Galuščák Bohdan","zahraniční klub","bez","S2",1949]
[35,"Hanšut Pavol","zahraniční klub","bez","S2",1953]
[36,"Horný Luboš","zahraniční klub","bez","S2",1951]
[37,"Janko Miroslav","zahraniční klub","bez","S2",1951]
[38,"Kadúc Ján","zahraniční klub","bez","S2",1952]
[39,"Kovačič Rudolf","zahraniční klub","bez","S2",1953]
[40,"Lachký Ondrej","zahraniční klub","bez","S2",1953]
[41,"Magdolen Milan","zahraniční klub","bez","S2",1951]
[42,"Machálek Rudolf","zahraniční klub","bez","S",1956]
[43,"Masaryk František","zahraniční klub","bez","S",1958]
[44,"Novotný Dušan","zahraniční klub","bez","S2",1948]
[45,"Orlický Peter","zahraniční klub","bez","S",1959]
[46,"Palovič Igor","zahraniční klub","bez","S",1957]
[47,"Petráš Juraj","zahraniční klub","bez","S",1959]
[48,"Pukanec Dušan","zahraniční klub","bez","S",1956]
[49,"Pukanec Peter","zahraniční klub","bez","S",1959]
[50,"Rozič Ján","zahraniční klub","bez","S",1956]
[51,"Tarábek Ján","zahraniční klub","bez","S2",1952]
[52,"Vávra Jaroslav","zahraniční klub","bez","S2",1951]
[53,"Drgoňová Jana","zahraniční klub","bez","Se",1958]
[54,"Janková Daniela","zahraniční klub","bez","Se",1953]
[55,"Kadúcová Mária","zahraniční klub","bez","Se",1956]
[56,"Magdolenová Mária","zahraniční klub","bez","Se",1950]
[57,"Varínska Ružena","zahraniční klub","bez","Se",1957]
[58,"Palovičová Oľga","zahraniční klub","bez","Se",1958]
[59,"Bednář Jaromír","KDG Šternberk","bez","S2",1931]
[60,"Bednář Jiří","KDG Šternberk","bez","S",1956]
[61,"Binder Bohdan","nezadán","bez","S",1956]
[62,"Gerža Ivan","TJ UNEX Uničov","bez","S",1958]
[63,"Heinzl Milan","KDG Šternberk","bez","S2",1953]
[64,"Hejný Zdeněk","nezadán","bez","S",1958]
[65,"Karásek Otakar","KDG Šternberk","bez","S2",1947]
[66,"Karásek Jiří","KDG Šternberk",1,"S2",1949,"host. - KDG Tovačov"]
[67,"Kopeček Petr","nezadán","bez","S",1955]
[68,"Kreuzinger Miroslav","nezadán","bez","S2",1946]
[69,"Kreuzinger Josef","nezadán","bez","S2",1954]
[70,"Krč Roman","nezadán","bez","S",1963]
[71,"Muzikant Květoslav","nezadán","bez","S2",1953]
[72,"Mikudík Zdeněk","nezadán","bez","S",1958]
[73,"Římský Stanislav","TJ UNEX Uničov",5,"S",1959]
[74,"Šafařík Jaroslav","nezadán","bez","S2",1907]
[75,"Urbášek Milan","nezadán","bez","S",1956]
[76,"Vach Václav","nezadán","bez","S",1960]
[77,"Vráždil Milan","nezadán","bez","S",1956]
[78,"Martinů Věra","nezadán","bez","Se",1957]
[79,"Rakvicová Jitka","nezadán","bez","Se",1959]
[80,"Doležel Čeněk","nezadán","bez","S2",1946]
[81,"Ehrlich Jan","nezadán","bez","S2",1940]
[82,"Ehrlichová Hana","nezadán","bez","Se",1944]
[83,"Konupka Zdeněk","nezadán","bez","S2",1943]
[84,"Navrátil Jan","nezadán","bez","S2",1941]
[85,"Novák Jindřich","nezadán","bez","S",1960]
[86,"Pavlík František","nezadán","bez","S",1958]
[87,"Snášel Rudolf","nezadán","bez","S",1955]
[88,"Šenkyřík Miroslav","nezadán","bez","S",1958]
[89,"Štýbnar Vlastimil","nezadán","bez","S2",1954]
[90,"Vlk Josef","nezadán","bez","S2",1942]
[91,"Vybíral Vladimir","nezadán","bez","S2",1937]
[92,"Bauer Václav","nezadán","bez","S",1955]
[93,"Brabec Vladimír","nezadán","bez","S",1959]
[94,"Brada Josef","nezadán","bez","S2",1953]
[95,"Dlouhý Jiří","nezadán","bez","S2",1948]
[96,"Kabát Jaroslav","nezadán","bez","S2",1950]
[97,"Krieger Jaroslav","nezadán","bez","S2",1953]
[98,"Kroupa Karel","nezadán","bez","S2",1951]
[99,"Kučera Josef","nezadán","bez","S",1959]
[100,"Květoň Ondřej","nezadán","bez","S2",1950]
[101,"Naus Jindrich","nezadán","bez","S2",1952]
[102,"Říha Oldřich","nezadán","bez","S2",1954]
[103,"Polka Josef","nezadán","bez","S2",1953]
[104,"Sturma Jaroslav","nezadán","bez","S2",1953]
[105,"Zavadil Jaroslav","nezadán","bez","S",1955]
[106,"Běhounek Luboš ","nezadán","bez"]
[107,"Cejpek Miroslav","nezadán","bez","S2",1945]
[108,"Čech Vlastimír","nezadán","bez","S",1956]
[109,"Daniel Otakar","TJ Start Brno","bez","S2",1950]
[110,"Daniel Petr","nezadán","bez","S2",1954]
[111,"Drtil Lubos","nezadán","bez","S",1956]
[112,"Frko Pavel","nezadán","bez","S",1955]
[113,"Hájek Pavel","nezadán","bez","S2",1945]
[114,"Kreppel Rafael","nezadán","bez","S2",1949]
[115,"Nečas Miloslav","nezadán","bez","S2",1952]
[116,"Pácha Dalibor","nezadán","bez","S",1955]
[117,"Pardus Erik","nezadán","bez","S",1957]
[118,"Piotrowski Bohuslav","nezadán","bez","S",1957]
[119,"Piotrowski Zdeněk","nezadán","bez","S",1958]
[120,"Přerost Jiří","nezadán","bez","S2",1953]
[121,"Reda Michal","nezadán","bez","S",1956]
[122,"Cup Pavel","nezadán","bez"]
[123,"Stegner Jan","nezadán","bez","S",1955]
[124,"Janderová Milada","nezadán","bez","Se",1956]
[125,"Vrbová Jarmila","TJ Start Brno","bez","Se",1942]
[126,"Cagnar Pavol","nezadán","bez","S2",1925]
[127,"Czeto Oskar","nezadán","bez","S",1957]
[128,"Czeto Vojtěch","nezadán","bez","S2",1952]
[129,"Czeteová Alena","nezadán","bez","Se",1953]
[130,"Fedak Štefan","nezadán","bez","S2",1952]
[131,"Filgas Josef","nezadán","bez","S2",1931]
[132,"Filgasová Irena","nezadán","bez","Se",1934]
[133,"Gaspar Emil","nezadán","bez","S2",1925]
[134,"Gasparová Magda","nezadán","bez","Se",1934]
[135,"Gonosova Viera","nezadán","bez","Se",1947]
[136,"Grancic Milan","nezadán","bez","S",1957]
[137,"Hagan Pavol","nezadán","bez","S2",1953]
[138,"Helebrandt Robert","nezadán","bez","S2",1940]
[139,"Hlavna Boris","nezadán","bez","S",1957]
[140,"Hudak Miroslav","nezadán","bez","S",1960]
[141,"Jelenek Juraj","nezadán","bez","S2",1953]
[142,"Kabát Ludek","nezadán","bez","S",1959]
[143,"Kabát Milan","nezadán","bez","S2",1954]
[144,"Kudernac Jozef","nezadán","bez","S2",1954]
[145,"Lacknerova Maria","nezadán","bez","Se",1934]
[146,"Lopuchovky Peter","nezadán","bez","S",1962]
[147,"Lupanova Kristyna","nezadán","bez","Se",1953]
[148,"Margita Peter","nezadán","bez","S2",1953]
[149,"Mojzitova Anna","nezadán","bez","Se",1931]
[150,"Murin Peter","nezadán","bez","S",1957]
[151,"Niznik Ondrej","nezadán","bez","S",1962]
[152,"Pihorna Peter","nezadán","bez","S2",1953]
[153,"Remetei Rudolf","nezadán","bez","S2",1953]
[154,"Rovinsky Ladislav","nezadán","bez","S2",1951]
[155,"Seman Karol","nezadán","bez","S2",1943]
[156,"Semanova Frantiska","nezadán","bez","Se",1944]
[157,"Schultz Juraj","nezadán","bez","S",1963]
[158,"Schultzova Alzbeta","nezadán","bez","Se",1930]
[159,"Skacel Miroslav","nezadán","bez","S2",1954]
[160,"Slivka Jan","nezadán","bez","S",1959]
[161,"Sopko Roman","nezadán","bez","S2",1952]
[162,"Sandrejova Libuse","nezadán","bez","Se",1956]
[163,"Sterbinsky Ladislav","nezadán","bez","S2",1928]
[164,"Sterbinska Olga","nezadán","bez","Se",1920]
[165,"Tichy Radoslav","nezadán","bez","S",1959]
[166,"Toth Ladislav","nezadán","bez","S",1959]
[167,"Vondra Josef","nezadán","bez","S",1960]
[168,"Vrchovinsky Pavel","nezadán","bez","S2",1951]
[169,"Zavodny Lubomir","nezadán","bez","S",1959]
[170,"Fechtner Jan","SMG 2000 Ústí n. L.",1,"S2",1952,"host. - MG Seba Tanvald"]
[171,"Fechtner Helmut","SMG 2000 Ústí n. L.","bez","S2",1930]
[172,"Flugr Václav","nezadán","bez","S2",1944]
[173,"Fronek Arnost","nezadán","bez","S",1957]
[174,"Fronek Jindrich","nezadán","bez","S2",1950]
[175,"Hercik Karel","nezadán","bez","S",1956]
[176,"Jenc Jiri","nezadán","bez","S2",1944]
[177,"Katic Frantisek","nezadán","bez","S2",1946]
[178,"Krejci Vlastimil st","nezadán","bez","S2",1943]
[179,"Krysl Miroslav","nezadán","bez","S",1956]
[180,"Kudlacek Jiri","nezadán","bez","S",1957]
[181,"Krivanek Frantisek","nezadán","bez","S2",1932]
[182,"Kolarik Oldrich","nezadán","bez"]
[183,"Kocourek Pavel","nezadán","bez","S",1959]
[184,"Niederle Jiří","nezadán","bez","S",1960]
[185,"Pitor Jan","nezadán","bez","S2",1952]
[186,"Tosner Bretislav","nezadán","bez","S2",1950]
[187,"Vrany Ladislav","nezadán","bez","S2",1946]
[188,"Fronkova Ruzena","nezadán","bez","Se",1951]
[189,"Krejcova Bohuslava","nezadán","bez","Se",1946]
[190,"Jencova Marie","nezadán","bez","Se",1950]
[191,"Rehorova Jolana","nezadán","bez","Se",1956]
[192,"Vesela Marcela","nezadán","bez","Se",1955]
[193,"Ambrosy Bohumil","nezadán","bez","S2",1947]
[194,"Bina Pavel","nezadán","bez","S",1957]
[195,"Bokr Richard","MGK Spartak Příbram","bez","S2",1926]
[196,"Hajsman Bedrich","nezadán","bez","S2",1949]
[197,"Holan Vladimír","MGK Spartak Příbram","bez","S2",1953]
[198,"Jendruscak Jan","nezadán","bez","S2",1953]
[199,"Kadlec Vladimir","nezadán","bez","S2",1948]
[200,"Kalat Karel","nezadán","bez","S2",1944]
[201,"Kolarik Ivo","nezadán","bez","S2",1951]
[202,"Kropáček Václav","GC 85 Rakovník",2,"S",1955]
[203,"Kubal Jiri","nezadán","bez","S2",1950]
[204,"Kubíček Vladimír","nezadán","bez","S2",1948]
[205,"Krůdl Pavel","nezadán","bez","S2",1954]
[206,"Polak Vladimir","nezadán","bez","S2",1951]
[207,"Prchal Petr","1. MGC Děkanka Praha",3,"S2",1945]
[208,"Sladky Karel","nezadán","bez","S2",1949]
[209,"Simanek Josef","nezadán","bez","S2",1950]
[210,"Vacek Josef","nezadán","bez","S",1959]
[211,"Václavík Roman","1. MGC Děkanka Praha",4,"S2",1951]
[212,"Vácha Milan","MGK Spartak Příbram","bez","S2",1950]
[213,"Vrany Michal","nezadán","bez","S2",1950]
[214,"Horak Zdenek","nezadán","bez","S2",1946]
[215,"Nantl Bedrich","nezadán","bez","S2",1954]
[216,"Svoboda Miroslav","Start Kopřivnice",3,"S2",1949]
[217,"Stybor Aleš","Start Kopřivnice","bez","S2",1951]
[218,"Tandler Tomas","nezadán","bez","S2",1951]
[219,"Tandler Alexander","nezadán","bez","S2",1953]
[220,"Tandler Jaroslav","nezadán","bez","S",1955]
[221,"Vanek Josef","nezadán","bez","S2",1953]
[222,"Chalupová Jana","SK DG Chomutov","bez","Se",1959]
[223,"Strnadlova Bohumira","nezadán","bez","Se",1960]
[224,"Styborova Klara","nezadán","bez","Se",1948]
[225,"Boneš Josef","SKDG Jesenice","bez","S2",1940]
[226,"Bousek Ladislav","nezadán","bez","S2",1952]
[227,"Dudek Jan","nezadán","bez","S",1958]
[228,"Šlais Jiří","nezadán","bez","S2",1949]
[229,"Gubis Petr","nezadán","bez","S2",1950]
[230,"Hála Jan","SKGC Frant. Lázně","M","S2",1949]
[231,"Hála Pavel","nezadán","bez","S2",1953]
[232,"Havlas Petr","nezadán","bez","S2",1953]
[233,"Horáček Vlastislav","SKGC Frant. Lázně",4,"S",1959]
[234,"Jungman Josef","nezadán","bez","S2",1950]
[235,"Kratochvíl Jaroslav","SKDG Jesenice",2,"S2",1948]
[236,"Kremen Josef","nezadán","bez","S2",1952]
[237,"Lupták Miroslav","nezadán","bez","S2",1947]
[238,"Nečekal František st.","TJ MG Cheb",1,"S2",1949]
[239,"Prukl Jiří","nezadán","bez","S2",1947]
[240,"Stransky Jiri","nezadán","bez","S2",1949]
[241,"Šalát Antonín","nezadán","bez","S2",1949]
[242,"Vozka Ladislav","TJ MG Cheb","bez","S2",1951]
[243,"Nečekalová Jana","TJ MG Cheb",1,"Se",1958]
[244,"Bilik Lubomir","nezadán","bez","S",1960]
[245,"Fasko Peter","nezadán","bez","S2",1948]
[246,"Majer Ivan","nezadán","bez","S",1960]
[247,"Majer Vladimir","nezadán","bez","S2",1952]
[248,"Qualich Jozef","nezadán","bez","S2",1941]
[249,"Sabaka Dusan","nezadán","bez","S2",1952]
[250,"Struhar Daniel","nezadán","bez","S",1960]
[251,"Surovy Jan","nezadán","bez","S2",1947]
[252,"Stulajter Josef","nezadán","bez","S2",1942]
[253,"Stober Stefan","nezadán","bez","S2",1935]
[254,"Svantner Josef","nezadán","bez","S2",1950]
[255,"Polonyova Milena","nezadán","bez","Se",1952]
[256,"Baněček Jaroslav","nezadán","bez","S",1957]
[257,"Boháč Jaroslav","nezadán","bez","S",1956]
[258,"Brezina Petr","nezadán","bez","S2",1948]
[259,"Gut Jiří","TJ MG Cheb",2,"S2",1946]
[260,"Hesoun Jaromir","nezadán","bez","S",1960]
[261,"Chladecky Tomas","nezadán","bez","S2",1952]
[262,"Kodalík Jiří","MGC Plzeň","bez","S",1955]
[263,"Kuchar Jan st","nezadán","bez","S2",1951]
[264,"Merc Viliam","nezadán","bez","S2",1942]
[265,"Milota Vaclav","nezadán","bez","S",1956]
[266,"Monhart Jiri","nezadán","bez","S2",1945]
[267,"Molacek Pavel","nezadán","bez","S",1958]
[268,"Placr Jiri","nezadán","bez","S",1957]
[269,"Szafner Petr","nezadán","bez","S",1958]
[270,"Wolter Stanislav","nezadán","bez","S",1956]
[271,"Zucek Jiri","nezadán","bez","S",1959]
[272,"Placrova Dagmar","nezadán","bez","Se",1952]
[273,"Hricikova Jarmila","nezadán","bez","Se",1954]
[274,"Monhartova Miloslava","nezadán","bez","Se",1952]
[275,"Podroužková Kateřina","nezadán","bez","Se",1960]
[276,"Antal Zigmund","nezadán","bez","S2",1938]
[277,"Cako Viktor","TJ UNEX Uničov","bez","S",1959]
[278,"Cicmanec Josef","nezadán","bez","S",1958]
[279,"Cikes Zoltan","nezadán","bez","S",1959]
[280,"Ciliak Jaroslav","nezadán","bez","S2",1952]
[281,"Englisch Josef","nezadán","bez","S2",1951]
[282,"Hamlik Daniel","nezadán","bez","S2",1951]
[283,"Jiros Jindrich","nezadán","bez","S",1955]
[284,"Jurik Viliam","nezadán","bez","S",1959]
[285,"Kollar Ivan","nezadán","bez","S2",1942]
[286,"Svitok Eugen","nezadán","bez","S",1956]
[287,"Siller Frantisek","nezadán","bez","S2",1928]
[288,"Zachar Milan","nezadán","bez","S2",1940]
[289,"Zlocha Josef","nezadán","bez","S",1957]
[290,"Davidova Ludmila","nezadán","bez","Se",1951]
[291,"Basova Antonia","nezadán","bez","Se",1958]
[292,"Misenkova Sona","nezadán","bez","Se",1962]
[293,"Polonska Lubica","nezadán","bez","Se",1962]
[294,"Cech Miroslav","nezadán","bez","S",1955]
[295,"Jappel David","nezadán","bez","S",1957]
[296,"Jaros Jiri","nezadán","bez","S2",1954]
[297,"Jech Vit","nezadán","bez"]
[298,"John Jiri","nezadán","bez"]
[299,"Lauerman Marcel","nezadán","bez"]
[300,"Novak Jaroslav","nezadán","bez"]
[301,"Ondrusek Boris","nezadán","bez","S",1956]
[302,"Peringer Vladimir","nezadán","bez"]
[303,"Prosek Tomas","nezadán","bez","S2",1954]
[304,"Provaz Leo","nezadán","bez","S2",1953]
[305,"Schilhart Eduard","nezadán","bez","S",1956]
[306,"Strnad Lubos","nezadán","bez","S2",1954]
[307,"Striz Frantisek","nezadán","bez"]
[308,"Stuchly Ivan","nezadán","bez","S2",1954]
[309,null,null,"bez"]
[310,"Svoboda Pavel","nezadán","bez","S",1956]
[311,"Sarka Jiri","nezadán","bez","S",1956]
[312,"Sir Bohuslav","nezadán","bez"]
[313,"Spinka Petr","nezadán","bez","S2",1954]
[314,"Tacheci Jaroslav","nezadán","bez"]
[315,"Vancura Jan","nezadán","bez"]
[316,"Hrcek Pavel","nezadán","bez"]
[317,"Noskova Renata","nezadán","bez","Se",1956]
[318,"Svobodová Ludmila","1. MGC Děkanka Praha","bez","Se",1953]
[319,"Koziskova Miroslava","nezadán","bez","Se",1956]
[320,"Matejickova Marie","nezadán","bez"]
[321,"Pisecka Irena","nezadán","bez"]
[322,"Prokopova Jitka","nezadán","bez"]
[323,"Tlaskalova Jana","nezadán","bez","Se",1960]
[324,"Vilhelmova Alexandra","nezadán","bez","Se",1951]
[325,"Vilhelmova Irina","nezadán","bez","Se",1959]
[326,"Vlachova Dana","nezadán","bez","Se",1957]
[327,"Zahejska Dana","nezadán","bez"]
[328,"Bednář Harry","1. MGC Děkanka Praha",5,"S2",1947]
[329,"Bartos Ivan","nezadán","bez","S2",1952]
[330,"Bouda Vaclav","nezadán","bez","S",1955]
[331,"Dohnal Tomáš","SKDG Fortuna Radotín",2,"S2",1953]
[332,"Dadu Dušan","KDG Šternberk","bez","S",1959]
[333,"Dvoracek Ivan","nezadán","bez","S2",1946]
[334,"Ejem Drahomir","nezadán","bez","S2",1953]
[335,"Havlicek Milan","nezadán","bez"]
[336,"Hlozek Petr","nezadán","bez"]
[337,"Husek Vaclav","nezadán","bez","S2",1951]
[338,"Janalik Bedrich","nezadán","bez","S2",1953]
[339,"Javorek Petr","nezadán","bez"]
[340,"Kolar Martin","nezadán","bez","S",1958]
[341,"Kožíšek Milan","nezadán","bez","S2",1954]
[342,"Kracmer Stanislav","nezadán","bez","S2",1952]
[343,"Krondak Milos","nezadán","bez","S2",1947]
[344,"Metzger Eduard","nezadán","bez"]
[345,"Moravec Bohumil","1. MGC Děkanka Praha",5,"S2",1953]
[346,"Moravec Jiri","nezadán","bez","S2",1950]
[347,"Moravec Milan","1. MGC Děkanka Praha","bez","S2",1952]
[348,"Mur Lubomir","nezadán","bez","S2",1952]
[349,"Nemecek Petr","nezadán","bez","S",1955]
[350,"Nemec Miroslav","nezadán","bez","S2",1952]
[351,"Pavelek Ivo","nezadán","bez","S",1955]
[352,"Pelikan Vladislav","nezadán","bez","S2",1954]
[353,"Pospisil Jiri","nezadán","bez"]
[354,"Prys Zdenek","nezadán","bez"]
[355,"Rosendorf Karel","SKDG Fortuna Radotín",3,"S2",1950]
[356,"Skalička Vladislav","ANH Praha","bez","S",1955]
[357,"Svoboda Zavis","nezadán","bez","S",1956]
[358,"Vávra Zdeněk","1. MGC Děkanka Praha",3,"S2",1953]
[359,"Vlach Milan","nezadán","bez","S2",1952]
[360,"Vysloužil Josef","Dian Viktorie Praha 8","bez"]
[361,"Adamek Zdenek","nezadán","bez","S2",1924]
[362,"Apellova Alena","nezadán","bez","Se",1955]
[363,"Arbeit František","MGC Olomouc","bez"]
[364,"Arbeit Marcel","MGC Olomouc","bez","S",1959]
[365,"Benčík Leonard","MGC Olomouc",3,"S",1959]
[366,"Brtnik Jan","nezadán","bez","S2",1947]
[367,"Burian Martin","nezadán","bez","S",1960]
[368,"Horak Klaus","nezadán","bez"]
[369,"Henklová Danuše","MGC Olomouc",1,"Se",1954]
[370,"Chytil Stanislav",null,"bez","S",1958]
[371,"Janalik Petr","nezadán","bez","S",1955]
[372,"Jilek Jiri","nezadán","bez","S",1955]
[373,"Kappl Rudolf","nezadán","bez","S2",1943]
[374,"Kliment Antonín","nezadán","bez","S2",1953]
[375,"Kral Vladimir","nezadán","bez","S",1958]
[376,"Kratschmer Bohumir","Seefeld - Kadolz (AT)","bez","S2",1950]
[377,"Krbcova Jaroslava","nezadán","bez","Se",1955]
[378,"Krbec Vladislav","nezadán","bez","S",1955]
[379,"Kubinek Frantisek","nezadán","bez","S2",1916]
[380,"Kubinek Josef","nezadán","bez","S2",1919]
[381,"Kubinek Roman","nezadán","bez","S",1957]
[382,"Kucera Karel","nezadán","bez","S2",1940]
[383,"Kucera Ladislav","nezadán","bez","S2",1943]
[384,"Kunc Kamil","nezadán","bez","S",1955]
[385,"Kylar Zdenek","nezadán","bez","S2",1944]
[386,"Kylarova Pavla","nezadán","bez","Se",1946]
[387,"Marek Ivan","nezadán","bez"]
[388,"Nehera Vojtěch","nezadán","bez","S2",1946]
[389,"Niedecki Josef","nezadán","bez","S2",1946]
[390,"Pitucha Miroslav","nezadán","bez","S2",1948]
[391,"Pustofka František","MGC Olomouc",3,"S2",1951]
[392,"Rozsival Jaroslav","nezadán","bez","S2",1949]
[393,"Ryšlink Pavel","nezadán","bez","S2",1942]
[394,"Ryšlink Zdeněk","nezadán","bez","S2",1920]
[395,"Sibelova Helena","nezadán","bez"]
[396,"Slivecka Jindrich","nezadán","bez","S2",1930]
[397,"Sarapatka Borivoj ml","nezadán","bez","S",1959]
[398,"Šimek Pavel","MGC Olomouc","bez","S2",1943]
[399,"Vaca Ivan","nezadán","bez","S2",1939]
[400,"Vacaova Marta","nezadán","bez","Se",1945]
[401,"Valentova Svatava","nezadán","bez"]
[402,"Vítek Aleš","MGC Olomouc",1,"S",1959]
[403,"Sarapatka Borivoj st","nezadán","bez","S2",1926]
[404,"Jašek Vladislav","MGC Olomouc",5,"S2",1954]
[405,"Jašek Jindřich","MGC Olomouc",1,"S",1955]
[406,"Kreuzingerová Irena","nezadán","bez","Se",1961]
[407,"Kanta Zdenek","nezadán","bez","S",1959]
[408,"Mráz Josef","SK DG Chomutov",3,"S",1956]
[409,"Peterik Leos","nezadán","bez","S",1960]
[410,"Grebenickova Jirina","nezadán","bez","Se",1954]
[411,"David Miroslav","nezadán","bez","S",1958]
[412,"Zapletal Zdeněk","TJ UNEX Uničov","bez","S",1959]
[413,"Dubiny Jaroslav","nezadán","bez","S",1959]
[414,"Elschek Kristian","nezadán","bez","S",1956]
[415,"Fridrik Achim","TJ Bystřice p. H.","bez","S",1955]
[416,"Klimes Bojan","nezadán","bez","S2",1950]
[417,"Maruska Jaroslav","nezadán","bez","S",1955]
[418,"Bodorik Ivan","nezadán","bez","S",1965]
[419,"Demele Milan","nezadán","bez","S",1966]
[420,"Klinec Marian","nezadán","bez","S",1963]
[421,"Qualich Igor","nezadán","bez","S",1963]
[422,"Garajova Luba","nezadán","bez","Se",1955]
[423,"Krňávková Eva","KDG Šternberk","bez","Se",1963]
[424,"Oscadal Rudolf","nezadán","bez","S",1963]
[425,"Kucera Karel","nezadán","bez","S2",1940]
[426,"Tvaroh Petr","nezadán","bez","S",1961]
[427,"Drexler Petr","nezadán","bez","S2",1951]
[428,"Legiersky Milan","nezadán","bez","S",1957]
[429,"Mikus Milan","nezadán","bez","S",1959]
[430,"Sestaubr Ladislav","nezadán","bez","S2",1946]
[431,"Rulisek Hynek","nezadán","bez","S",1957]
[432,"Kropš Zdeněk","nezadán","bez","S2",1952]
[433,"Lisa Miroslav st.","SKDG Jesenice",1,"S2",1952]
[434,"Roemer Ivan","ŠK Adara Trnava (SK)",3,"S",1959]
[435,"Strnad Jiri","nezadán","bez","S",1956]
[436,"Stepanek Karel","nezadán","bez","S2",1951]
[437,"Stybnar Miroslav","nezadán","bez","S",1960]
[438,"Zboril Zdenek","nezadán","bez","S2",1951]
[439,"Buchcar Stefan","nezadán","bez","S2",1947]
[440,"Aschenbrenner Lumir","nezadán","bez","S",1960]
[441,"Brezina Zdenek","nezadán","bez","S2",1953]
[442,"Hubinger Miroslav","MG České údolí Plzeň 3",5,"S",1962]
[443,"Krasny Vladimir","nezadán","bez","S",1956]
[444,"Moravec Milan","MGC Plzeň","bez","S",1961]
[445,"Stasek Stanislav","nezadán","bez","S2",1948]
[446,"Schodelbauer Vladimir","nezadán","bez","S",1960]
[447,"Szafner Milos","nezadán","bez","S",1956]
[448,"Vanecek Miroslav","nezadán","bez","S",1959]
[449,"Heřmanová Růžena","MGC Plzeň","bez","Se",1957]
[450,"Čech Dalibor","nezadán","bez","S",1962]
[451,"Černy Richard","nezadán","bez","S",1961]
[452,"Horak Michal","nezadán","bez","S",1961]
[453,"Ruzicka Miroslav","nezadán","bez","S",1958]
[454,"Vevoda Miroslav","nezadán","bez","S",1961]
[455,"Gerbel Stanislav","nezadán","bez","S",1964]
[456,"Hvizdos Jaroslav","nezadán","bez","S",1960]
[457,"Kollar Peter","nezadán","bez","S",1960]
[458,"Lazarovsky Miroslav","nezadán","bez","S",1963]
[459,"Petrik Michal","nezadán","bez","S",1962]
[460,"Slivka Stefan","nezadán","bez","S",1960]
[461,"Mucka Jaroslav","1. MGC Děkanka Praha",5,"S",1956]
[462,"Mucka Miroslav","nezadán","bez","S2",1953]
[463,"Habovcikova Vanda","nezadán","bez","Se",1964]
[464,"Kolenickova Brona","nezadán","bez","Se",1963]
[465,"Pernica Antonín","nezadán","bez","S",1964]
[466,"Dostal Pavel","nezadán","bez","S",1961]
[467,"Studeny Vladimir","nezadán","bez","S2",1953]
[468,"Mala Eva","nezadán","bez","Se",1956]
[469,"Kalinova Magda","nezadán","bez","Se",1956]
[470,"Prachova Yveta","nezadán","bez","Se",1962]
[471,"Oboril Oto","nezadán","bez","S",1961]
[472,"Marsik Michal","nezadán","bez","S2",1954]
[473,"Handlikova Eva","nezadán","bez","Se",1958]
[474,"Kruliš Milan","TJ MG Cheb","bez","S2",1952]
[475,"Vančura Libor","MGC Hradečtí Orli","M","S",1961]
[476,"Lamparova Tamara","nezadán","bez","Se",1960]
[477,"Dostal Petr","nezadán","bez","M",1969]
[478,"Spacek Milan","nezadán","bez","S",1962]
[479,"Blaha Roman","nezadán","bez","S",1959]
[480,"Hlbocky Peter","nezadán","bez","S",1963]
[481,"Putnoky Michal","ŠK Adara Trnava (SK)","bez","S",1960]
[482,"Suster Josef","nezadán","bez","S2",1954]
[483,"Doubrava Pavel","nezadán","bez","S",1959]
[484,"Jarma Jaroslav","nezadán","bez","S",1960]
[485,"Rozmara Miroslav","nezadán","bez","S",1960]
[486,"Springl Petr","nezadán","bez","S",1961]
[487,"Štěpánek Vladimír","nezadán","bez","S2",1952]
[488,"Linek Petr","nezadán","bez","S",1959]
[489,"Brozmanova Viera","nezadán","bez","Se",1960]
[490,"Akstejn Jaromir","nezadán","bez","S2",1952]
[491,"Drexlerova Dagmar","nezadán","bez","Se",1956]
[492,"Oklestek Jiri","nezadán","bez","S2",1952]
[493,"Pachl Jaroslav","nezadán","bez","S",1957]
[494,"Piskovsky Jan","nezadán","bez","S",1956]
[495,"Gasperan Peter","nezadán","bez","S",1963]
[496,"Mikšík Rostislav","nezadán","bez","S2",1937]
[497,"Mikuš Josef","KDG Šternberk","bez","S2",1940]
[498,"Fort Miroslav","nezadán","bez","S",1960]
[499,"Ponizil Pavel","nezadán","bez","S",1964]
[500,"Kapes Jiri","nezadán","bez","S",1960]
[501,"Jendruscakova Lenka","nezadán","bez","Se",1960]
[502,"Hofrichter Michael","nezadán","bez","S",1963]
[503,"Tesar Vladimir","nezadán","bez","S",1963]
[504,"Bagin Roman","nezadán","bez","S",1963]
[505,"Duda Drahomir","nezadán","bez","S",1955]
[506,null,"nezadán","bez"]
[507,"Krasa Jan","nezadán","bez","S2",1954]
[508,"Kvesova Irena","nezadán","bez","Se",1956]
[509,"Ladman Petr","nezadán","bez","S2",1954]
[510,"Metelka Ladislav","Dian Viktorie Praha 8","bez","S",1965]
[511,"Novak Petr","nezadán","bez","S",1955]
[512,"Sojak Jiri","nezadán","bez","S",1955]
[513,"Stejskal Marek","nezadán","bez","S",1960]
[514,"Silhavy Vaclav","nezadán","bez","S2",1954]
[515,"Vesely Martin","nezadán","bez"]
[516,"Vesely Jiri","nezadán","bez"]
[517,"Dukatova Alzbeta","nezadán","bez","Se",1947]
[518,"Zatko Stefan","nezadán","bez","S",1957]
[519,"Lorinc Jan","nezadán","bez","S",1959]
[520,"Hajek Vladimir","nezadán","bez","S",1957]
[521,"Janci Jan","nezadán","bez","S",1960]
[522,"Dano Milos","nezadán","bez","S",1960]
[523,"Majova Julia","nezadán","bez","Se",1960]
[524,"Kastner Vaclav","nezadán","bez","S2",1953]
[525,"Prdova Vera","nezadán","bez","Se",1957]
[526,"Birešová Vlasta","SKGC Frant. Lázně",2,"Se",1957]
[527,"Jirkalova Eva","nezadán","bez","Se",1960]
[528,"Mleziva Ladislav","SKDG Jesenice","bez","S",1964]
[529,"Magyarics Michal","nezadán","bez","S",1966]
[530,"Magyaricsova Yveta","nezadán","bez","Se",1965]
[531,"Sucha Mario","nezadán","bez","S",1966]
[532,"Tulisova Marie","nezadán","bez","Se",1966]
[533,"Krakora Petr","nezadán","bez","S",1965]
[534,"Marek Borivoj","nezadán","bez","S",1956]
[535,"Lisová Věra","SKDG Jesenice",3,"Se",1954]
[536,"Gerža Vít","MGC Olomouc",1,"S",1966]
[537,"Zapletal Pavel","KDG Šternberk","bez","M",1968]
[538,"Karásek Kamil","KDG Šternberk","bez","M",1969]
[539,"Maňák Vratislav","nezadán","bez","S",1965]
[540,"Kollarova Zdena","nezadán","bez","Se",1959]
[541,"Blazek Juraj","nezadán","bez","S",1963]
[542,"Becvarik Miroslav","nezadán","bez","S",1956]
[543,"Becvarik Vladislav","nezadán","bez","S",1956]
[544,"Šneider Vladimír","nezadán","bez","S",1955]
[545,"Houska Miroslav","nezadán","bez","S2",1954]
[546,"Markova Alena","nezadán","bez","Se",1960]
[547,"Dembovska Zuzana","nezadán","bez","Se",1960]
[548,"Klimova Miroslava","nezadán","bez","Se",1960]
[549,"Halaska Jaroslav","nezadán","bez","S",1959]
[550,"Hufnagel Stepan","nezadán","bez","S",1966]
[551,"Kotek Michal","1. MGC Děkanka Praha",1,"S",1965]
[552,"Pergl Jan","1. MGC Děkanka Praha",2,"S",1965]
[553,"Korelus Jiří","nezadán","bez","S2",1951]
[554,"Korelusova Nadezda","nezadán","bez","Se",1956]
[555,"Hloch Marek","KDG Šternberk","bez","M",1968]
[556,"Tazky Jan","nezadán","bez","S",1957]
[557,"Kolesarova Viera","nezadán","bez","Se",1958]
[558,"Lucatincova Alena","nezadán","bez","Se",1956]
[559,"Fiala Libor","nezadán","bez","M",1970]
[560,"Jadrny Milan","nezadán","bez","S",1961]
[561,"Langer Jiří","MGC Opava","bez","S",1956]
[562,"Hanzelka Lumír","KDG 2000 Ostrava",2,"S",1956]
[563,"Sedláček Vladimír","1. DGC Bystřice p. H.",2,"S2",1950]
[564,"Smolin Roman","nezadán","bez","S",1964]
[565,"Piskacek Jaromir","nezadán","bez","S2",1954]
[566,"Prokša Pavel","SKDG Fortuna Radotín","bez","S2",1949]
[567,null,null,"bez"]
[568,"Cipra Petr","nezadán","bez","S",1958]
[569,"Zurek Vladimir","nezadán","bez","S2",1948]
[570,"Vlach Petr","nezadán","bez","S",1956]
[571,"Mechacek Radek","nezadán","bez","S",1967]
[572,"Holub Leopold","MGC Jedovnice",1,"S",1965]
[573,"Zeh Karel","nezadán","bez","S",1965]
[574,"Bokvaj Leos","nezadán","bez","S",1957]
[575,"Capek David","nezadán","bez","S",1965]
[576,"Dvorak Vladimir","nezadán","bez","S",1961]
[577,"Drahokoupil Ivo","nezadán","bez","S",1966]
[578,"Hölzel Robert","1. MGC Děkanka Praha",1,"S",1960]
[579,"Hybner Robert","1. MGC Děkanka Praha","M","S",1964]
[580,"Koudelka Jiri","nezadán","bez","S",1955]
[581,"Meitnerova Jana","nezadán","bez","Se",1962]
[582,"Stradal Jiri","nezadán","bez","S",1956]
[583,"Vondrich Ales","nezadán","bez","S",1964]
[584,"Vyklicky Josef","nezadán","bez","S",1965]
[585,"Hlavac Jiri","nezadán","bez","S",1964]
[586,"Rotrekl Rostislav","nezadán","bez","S",1966]
[587,"Krejčí Vlastimil ml.","nezadán","bez","S",1966]
[588,"Slavicek Rudolf","nezadán","bez","S",1962]
[589,"Hartman Vladimir","nezadán","bez","S2",1953]
[590,"Jezdinsky Vladimir","nezadán","bez","S2",1952]
[591,"Kasik Petr","nezadán","bez","S",1956]
[592,"Kocvara Ludek","nezadán","bez","S",1955]
[593,"Samova Alexandra","nezadán","bez","Se",1959]
[594,"Sebele Jiri","nezadán","bez","S",1960]
[595,"Šedek Jaroslav","1. MGC Děkanka Praha","bez","S",1955]
[596,"Tvrdoch Ivan","nezadán","bez","S2",1948]
[597,"Hirschmann Dagmar","TJ MG Cheb","M","Se",1961]
[598,"Velinska Marcela","nezadán","bez","Se",1957]
[599,"Wowesny Ivan","nezadán","bez","S2",1952]
[600,"Bokrová Josefa","MGK Spartak Příbram","bez","Se",1926]
[601,"Pcelar Jiri","nezadán","bez","S2",1952]
[602,"Krůdlová Miroslava","nezadán","bez","Se",1957]
[603,"Pichova Marie","nezadán","bez","Se",1952]
[604,"Bradler Miroslav","nezadán","bez","S",1962]
[605,"Ceska Karel","nezadán","bez","S",1957]
[606,"Slivkova Eva","nezadán","bez","Se",1963]
[607,"Hudak Jaroslav","nezadán","bez","S",1963]
[608,"Nejedly Zdenek","nezadán","bez","S2",1954]
[609,"Čása Ivan","SKDG Fortuna Radotín","bez","S",1962]
[610,"Turcan Jan","nezadán","bez","S",1956]
[611,"Kvasnicka Milos","nezadán","bez","S",1963]
[612,"Arpas Vladimir","nezadán","bez","S",1959]
[613,"Uhrikova Miroslava","nezadán","bez","Se",1964]
[614,null,null,"bez"]
[615,"Wiesengangerova Dagmar","nezadán","bez","Se",1960]
[616,"Pospichal Karel","nezadán","bez","S",1960]
[617,"Antalovic Miloslav","nezadán","bez","S",1965]
[618,"Meszáros Jaroslav","MGC Olomouc","bez","S",1965]
[619,"Hanuska Petr","nezadán","bez"]
[620,"Hofman Pavel","nezadán","bez"]
[621,"Bystricky Pavel","nezadán","bez","S",1965]
[622,"Schmidt Oleg","nezadán","bez","S",1965]
[623,"Filipovic Libor","nezadán","bez","S",1964]
[624,"Kasparovsky Otto","nezadán","bez","S",1959]
[625,"Prucha Pavel","nezadán","bez","S",1959]
[626,"Korinek Milos","nezadán","bez","S",1960]
[627,"Hlaváčová Anna","nezadán","bez","Se",1958]
[628,"Kubesa Jindřich","MGC Opava","bez","S2",1952]
[629,"Sedláčková Ludmila","MGC Opava","bez","Se",1958]
[630,"Sedláček Jaromír","MGC Opava","bez","S2",1954]
[631,"Suchon Juraj","nezadán","bez","S",1967]
[632,"Micek Pavel","nezadán","bez","S",1965]
[633,"Mlcochova Blanka","nezadán","bez","Se",1961]
[634,"Hromada Jan","nezadán","bez","S",1957]
[635,"Sklenar Vitezslav","nezadán","bez","S",1966]
[636,"Jircik Zdenek","nezadán","bez","S",1963]
[637,"Liskovsky Roman","nezadán","bez","S",1959]
[638,"Cicha Jaroslav","nezadán","bez","S",1966]
[639,"Macek František","MGC Hradečtí Orli","bez"]
[640,"Krejci Petr","nezadán","bez","S",1966]
[641,"Skorpil Bohuslav","nezadán","bez","S",1964]
[642,"Dokoupilová Milena","nezadán","bez","Z",1969]
[643,"Suba Milan","nezadán","bez","M",1969]
[644,"Petr Jiri","nezadán","bez","S",1965]
[645,"Jaško Marek","KDG Šternberk","bez","M",1970]
[646,"Horackova Miloslava","nezadán","bez","Se",1961]
[647,"Pergl Oldrich","nezadán","bez","M",1969]
[648,"Valenta David","TJ Start Brno","bez","M",1970]
[649,"Dvorak Pavel","nezadán","bez","S2",1947]
[650,"Vodenkova Milena","nezadán","bez","Se",1952]
[651,"Vodenka Josef","nezadán","bez","S2",1952]
[652,"Bireš Jan","SKGC Frant. Lázně","M","S2",1952]
[653,"Mleziva Václav","nezadán","bez","S",1967]
[654,"Hazuka Tomas","nezadán","bez","M",1968]
[655,"Sniegon Erik","nezadán","bez","S",1956]
[656,"Svoboda Josef","nezadán","bez","S2",1949]
[657,"Zapletal Ivo","nezadán","bez","S2",1932]
[658,"Zapletal Roman","nezadán","bez","M",1969]
[659,"Kubík Zdeněk","SK DG Chomutov","bez","S2",1948]
[660,"Budak Milan","nezadán","bez","S",1957]
[661,"Kovac Jan","nezadán","bez","S2",1954]
[662,"Pavlik Jan","nezadán","bez","S",1957]
[663,"Pavlik Pavel","nezadán","bez","S",1957]
[664,"Novotny Dan","nezadán","bez","S",1960]
[665,"Kasparovska Ivana","nezadán","bez","Se",1960]
[666,"Polonsky Milan","nezadán","bez","S2",1937]
[667,"Podolan Martin","nezadán","bez","S",1962]
[668,"Proksova Vladimira","nezadán","bez","Se",1950]
[669,"Piskala Richard","nezadán","bez","S",1964]
[670,"Valenta Jan","PSV Policei Steyr (AT)","bez","S2",1946]
[671,"Pravotiak Vladimir","nezadán","bez","S",1963]
[672,"Auxt Jozef","nezadán","bez","S",1959]
[673,"Metyš Jan","MGC Olomouc","M","S",1966]
[674,"Metyš Vladimír","MGC ´90 Brno","bez","S",1964]
[675,"Klimes Petr","nezadán","bez","S",1962]
[676,"Molnár Karel st.","SK DG Chomutov","bez","S",1961]
[677,"Jahoda Petr","nezadán","bez","S",1965]
[678,"Strakos Tomas","nezadán","bez","S",1966]
[679,"Studeny Petr","nezadán","bez","S",1963]
[680,"Kubešová Eva","MGC Opava","bez","Se",1954]
[681,"Ujvary Vladimir","nezadán","bez","S",1956]
[682,"Juris Karol","nezadán","bez","S",1966]
[683,"Blecha Vaclav","nezadán","bez","S",1962]
[684,"Henichova Iva","nezadán","bez","Se",1962]
[685,"Šuk Petr","TJ MG Cheb","bez","M",1973]
[686,"Veselý Vítězslav","nezadán","bez","S2",1940]
[687,"Veselá Jaroslava","nezadán","bez","Se",1943]
[688,"Pěničková Vítězslava","nezadán","bez","Se",1964]
[689,"Vesela Michala","nezadán","bez","Z",1971]
[690,"Forberger Petr","nezadán","bez","S",1965]
[691,"Koukal Ivo","nezadán","bez","S",1966]
[692,"Švihel Ladislav","ME Blansko","M","S2",1953]
[693,"Tomek Libor","MGC ´90 Brno","bez","S",1962]
[694,"Hlavka Pavel","nezadán","bez","S",1962]
[695,"Jedlicka Stanislav","nezadán","bez","S2",1947]
[696,"Vodňanský Ladislav","MGC Plzeň",4,"S2",1954]
[697,"Simocko Alex","nezadán","bez","S",1963]
[698,"Vodnanska Zdenka","nezadán","bez","Se",1953]
[699,"Radenkov Radko","nezadán","bez","M",1970]
[700,"Šuba Radek","nezadán","bez","M",1971]
[701,"Valentová Věra","nezadán","bez","Se",1948]
[702,"Grill Jaroslav","nezadán","bez","S2",1922]
[703,"Sosta Jana","nezadán","bez","Se",1963]
[704,"Sosty Miroslav","nezadán","bez","S2",1953]
[705,"Puchmeltr Zdenek","nezadán","bez","S",1962]
[706,"Eliasova Eliska","nezadán","bez","Se",1956]
[707,"Murgac Stefan","nezadán","bez","S",1958]
[708,"Vavro Igor","nezadán","bez","S",1964]
[709,"Nasticky Milan","nezadán","bez","S",1957]
[710,"Skopec Mojmir","nezadán","bez","S",1964]
[711,"Brázda Jan","nezadán","bez","S2",1933]
[712,"Wenzl Daniel","SKDG Jesenice",3,"S",1963]
[713,"Roško Pavel","nezadán","bez","S",1965]
[714,"Horák Pavel","MGC Jedovnice",4,"S",1963]
[715,"Langr Libor","MGC Opava","bez","S",1956]
[716,"Lipmann Karel st.","nezadán","bez","S",1963]
[717,"Mach Petr","nezadán","bez","S",1964]
[718,"Podhradsky Pavel","nezadán","bez","S",1964]
[719,"Fučík Jiří","SKDG Jesenice","bez","S",1960]
[720,"Mracek Vladimir","nezadán","bez","S",1964]
[721,"Kubesa Michael","nezadán","bez","S",1959]
[722,"Vidím Jan","nezadán","bez","S",1964]
[723,"Svejda Ludek","nezadán","bez","S",1963]
[724,"Morava Petr","nezadán","bez","S",1964]
[725,"Sustek Jiri","nezadán","bez","S",1961]
[726,"Šobor Jan ml.","nezadán","bez","S",1964]
[727,"Šobor Jan","SK TEMPO Praha",3,"S2",1941]
[728,"Pacovská Zuzana","1. MGC Děkanka Praha","bez","Se",1962]
[729,"Haragsim Lukas","nezadán","bez","S",1964]
[730,"Jasek Miroslav","nezadán","bez","S",1958]
[731,"Runtag Bretislav","nezadán","bez","S",1956]
[732,"Kuba František","MGC Olomouc","M","S2",1953]
[733,"Sedlacek Petr","nezadán","bez","S",1962]
[734,"Beran Jaroslav","nezadán","bez","S2",1933]
[735,"Nedele Petr","nezadán","bez","S2",1938]
[736,"Beranová Růžena","nezadán","bez","Se",1939]
[737,"Coelbova Miluse","nezadán","bez","Se",1951]
[738,"Hanelova Marie","nezadán","bez","Se",1949]
[739,"Kriz Vladimir","nezadán","bez","S2",1940]
[740,"Krizova Miroslava","nezadán","bez","Se",1944]
[741,"Nedělová Helena","nezadán","bez","Se",1944]
[742,"Beran Bohuslav","nezadán","bez","S2",1934]
[743,"Nikodem Miroslav","nezadán","bez","S2",1948]
[744,"Simcik Jiri","nezadán","bez","S2",1950]
[745,"Sramek Jiri","nezadán","bez","S",1959]
[746,"Benda Lumír","MGC Plzeň",1,"S",1965]
[747,"Ronovsky Vladimir","nezadán","bez","S",1961]
[748,"Tuháček Jaroslav","MGC Plzeň","bez","S",1965]
[749,"Škurek Svatopluk","TJ Start Brno",4,"S",1964]
[750,"Karaivanov Boris","MGC ´90 Brno","bez","S",1965]
[751,"Matatko Branislav","nezadán","bez","S",1959]
[752,"Szlaur Milan","nezadán","bez","S",1961]
[753,"Klima Jaroslav","nezadán","bez","S",1955]
[754,"Goetz Zdenek","nezadán","bez","S",1955]
[755,"Martinkova Hana","nezadán","bez","Se",1962]
[756,"Grossman Bretislav","nezadán","bez","S",1959]
[757,"Hellebrand Vladimir","nezadán","bez","S2",1951]
[758,"Šneiderová Dana","nezadán","bez","Se",1941]
[759,"Vorlickova Zdenka","nezadán","bez","Se",1962]
[760,"Jung Zdeněk","nezadán","bez","S",1959]
[761,"Bauer Martin","MGC Olomouc","bez","S",1967]
[762,"Šperlich Pavel","MGC Olomouc","bez","S",1965]
[763,"Friedrich Vaclav","nezadán","bez","S",1961]
[764,"Florik Petr","nezadán","bez","S",1959]
[765,"Kunzendorfer Jar. st.","nezadán","bez","S2",1942]
[766,"Labanc Pavel","nezadán","bez","S",1964]
[767,"Vachova Drahomira","nezadán","bez","Se",1956]
[768,"Macourová Eva","1. MGC Děkanka Praha",2,"Se",1951]
[769,"Macour Julián","nezadán","bez","S2",1950]
[770,"Stefanik Jan","nezadán","bez","S",1966]
[771,"Tolarovič Ján","MGC Olomouc",2,"M",1968,"host. - ŠK Adara Trnava (SK)"]
[772,"Kristofiak Jan","nezadán","bez","S",1963]
[773,"Rozic Jozef","nezadán","bez","S",1967]
[774,"Pätoprsty Ivan","nezadán","bez","S2",1950]
[775,"Kontina Lubomir","nezadán","bez","S",1966]
[776,"Fridriková Dana","TJ Bystřice p. H.","bez","Se",1964]
[777,"Šimanský René","ŠK Adara Trnava (SK)","bez","M",1968]
[778,"Hofman Zdenek","nezadán","bez","S",1961]
[779,"Polivka Vlastimil","nezadán","bez","S",1959]
[780,"Svarc Josef","nezadán","bez","S",1958]
[781,"Kuzma Pavel","nezadán","bez","M",1968]
[782,"Tardon František","nezadán","bez","S2",1953]
[783,"Čech Vladimír","SKDG Fortuna Radotín",5,"S2",1951]
[784,"Zatloukal Miloslav","nezadán","bez","S",1957]
[785,"Vaňák Václav","MGC Olomouc",2,"S2",1953]
[786,"Kosik Jakub","nezadán","bez","S",1963]
[787,"Simunkova Renata","nezadán","bez","Se",1963]
[788,"Maxa Ludvik","nezadán","bez","S",1960]
[789,"Sladek Viktor","nezadán","bez","M",1968]
[790,"Kunzendörfer Jaroslav","SKDG Jesenice","bez","M",1973]
[791,"Blaha Miroslav","nezadán","bez","S",1965]
[792,"Weinmannova Milada","nezadán","bez","Se",1951]
[793,"Stefan Josef","nezadán","bez","S2",1932]
[794,"Kostal Ivan","nezadán","bez","S",1965]
[795,null,null,"bez"]
[796,"Juran Josef","MGC Hradečtí Orli","bez","S2",1933]
[797,"Šrůtek Pavel","MGC Hradečtí Orli","bez","S",1955]
[798,"Kautzký Pavel","MGC Hradečtí Orli","bez","S",1958]
[799,"Steklý Miroslav","MGC Hradečtí Orli",1,"S",1966]
[800,"Pavelka Robert","MGC Hradečtí Orli","bez","S",1959]
[801,"Vaněčková Jaroslava","MGC Hradečtí Orli","bez","Se",1945]
[802,"Zelený Martin","MGC Hradečtí Orli","bez","S",1962]
[803,"Juran Tomáš","MGC Hradečtí Orli","bez","M",1971]
[804,"Vaněček Pavel","MGC Hradečtí Orli","bez","S2",1946]
[805,"Synková Milena","MGC Hradečtí Orli","bez","Se",1951]
[806,"Vavercak Petr","nezadán","bez","M",1970]
[807,"Mrazek Frantisek","nezadán","bez","S",1964]
[808,"Kuthan Pavel","nezadán","bez","S2",1954]
[809,"Mandák Josef","SK DG Chomutov",2,"S",1961]
[810,"Lipmann Milan","SK TEMPO Praha",1,"M",1969]
[811,"Pašek Roman","SK DG Chomutov","bez","S",1966]
[812,"Valenta Richard","MGC Hradečtí Orli","bez","S",1966]
[813,"Bittengl Jaroslav","nezadán","bez","S",1959]
[814,"Podroužek Václav","nezadán","bez","S2",1948]
[815,"Sigl Vojtech","nezadán","bez","M",1971]
[816,"Siglova Jana ml.","nezadán","bez","Z",1968]
[817,"Siglova Jana st.","nezadán","bez","Se",1943]
[818,"Vozka Radek","nezadán","bez","S",1967]
[819,"Tureček Vlastimil","nezadán","bez","M",1968]
[820,"Praisler Tomas","nezadán","bez","M",1974]
[821,"Pidrman Petr","nezadán","bez","S",1956]
[822,"Machova Marie","nezadán","bez","Se",1948]
[823,"Jirasek Karel","nezadán","bez","M",1969]
[824,"Hrudník Ladislav","nezadán","bez","S",1967]
[825,"Baskova Andrea","nezadán","bez","M",1969]
[826,"Jirickova Lenka","nezadán","bez","Se",1966]
[827,"Holboj Svatopluk","Start Kopřivnice","bez","S",1966]
[828,"Berkyova Jana","nezadán","bez","Se",1966]
[829,"Antos Vaclav","nezadán","bez","M",1968]
[830,null,null,"bez"]
[831,null,null,"bez"]
[832,"Hodkova Lenka","nezadán","bez","Se",1962]
[833,"Mužík Pavel","SK TEMPO Praha",1,"S2",1948]
[834,"Sokol Peter","nezadán","bez"]
[835,"Rykrova Eva","nezadán","bez"]
[836,"Tvarozekova Eva","nezadán","bez"]
[837,"Mano Peter","nezadán","bez","S",1965]
[838,"Baloun Robert","nezadán","bez","S",1964]
[839,"Sokol Igor","nezadán","bez","M",1968]
[840,"Zurek Jaroslav","MGC Opava","bez","S",1959]
[841,"Namesna Denisa","nezadán","bez","Se",1967]
[842,"Novak Roman","nezadán","bez","S",1966]
[843,"Misovicova Iveta","nezadán","bez","Se",1967]
[844,"Minich Marian","nezadán","bez","M",1968]
[845,"Kalnik Jozef","nezadán","bez","S",1964]
[846,"Brossmann Igor","nezadán","bez","S",1966]
[847,"Petrzela Vladislav","MGC Opava","bez","S",1960]
[848,"Kandera Lubomir","nezadán","bez","M",1968]
[849,"Kandera Stanislav","nezadán","bez","M",1970]
[850,"Krizek Miroslav","nezadán","bez","S",1965]
[851,"Stroupkova Jana","nezadán","bez","Se",1965]
[852,"Stolar Marcel","nezadán","bez","S",1967]
[853,"Cipro Petr","SK DG Chomutov","bez","S",1962]
[854,"Jaskova Bozena","nezadán","bez","Se",1963]
[855,"Kellner Ivan","nezadán","bez","M",1971]
[856,"Kuna Štěpán","nezadán","bez","S",1966]
[857,"Duchek Ladislav","MG SEBA Tanvald",5,"S2",1946]
[858,"Novák Libor","MG SEBA Tanvald",1,"S2",1950]
[859,"Bukvicová Dagmar","nezadán","bez","Se",1959]
[860,"Nepimach Luboš st.","MG SEBA Tanvald",2,"S2",1939]
[861,"Poslušný Zdeněk","MG SEBA Tanvald",2,"S2",1950]
[862,"Vavrova Zuzana","nezadán","bez","Se",1962]
[863,"Blumentrittova Hana","nezadán","bez","Se",1963]
[864,"Pelakova Jana","nezadán","bez","Se",1962]
[865,"Petelak Kvetoslav","nezadán","bez","S2",1932]
[866,"Kurka Josef","nezadán","bez","S2",1933]
[867,"Polonska Maria","nezadán","bez","Se",1943]
[868,"Parasin Jan","nezadán","bez","S",1967]
[869,"Kocourek Jiri","nezadán","bez","S",1967]
[870,"Kanuscak Pavel","nezadán","bez","S",1967]
[871,"Lahnerová Hana","nezadán","bez","Z",1969]
[872,"Hrubisek Ivo","nezadán","bez","S",1966]
[873,"Blumova Ludmila","nezadán","bez","Se",1964]
[874,"Stuchla Miloslav","nezadán","bez","S",1966]
[875,"Duchek René","žádný","bez","S",1967]
[876,"Vlček Petr","MGC Hradečtí Orli",1,"S",1962]
[877,"Kašpar Milouš","MG SEBA Tanvald",1,"S2",1947]
[878,"Skleničková Hana","nezadán","bez","Se",1958]
[879,"Holec Jaroslav","nezadán","bez","S",1965]
[880,"Borovička Jiří","KDG Šternberk","bez","M",1973]
[881,"Gaja Jindrich","nezadán","bez","M",1970]
[882,"Kadlec Jiří","TJ UNEX Uničov",5,"S",1961]
[883,"Kožíšek Martin","nezadán","bez","S",1965]
[884,"Kozisek Roman","nezadán","bez","S",1962]
[885,"Minar Jaroslav","nezadán","bez","S",1959]
[886,"Jedlicka Lubos","nezadán","bez","S2",1952]
[887,"Mikolanda Leos","nezadán","bez","S",1962]
[888,"Caka Jiri","nezadán","bez","S",1959]
[889,"Kristian Jan","MGC Olomouc","bez","S2",1949]
[890,"Pusch Petr","MGC Opava","bez","S",1958]
[891,"Pravda Jaroslav","MGC Opava","bez","S",1959]
[892,"Makovicka Stanislav","nezadán","bez","S2",1943]
[893,"Liska Jiri","nezadán","bez","S",1957]
[894,"Chmelir Miroslav","nezadán","bez","S",1961]
[895,"Jursa Otmar","ANH Praha","bez","S",1965]
[896,"Skalický Jaroslav","SK DG Chomutov","bez","S",1961]
[897,"Panuška Karel","nezadán","bez","S",1964]
[898,"Cermak Vlastimil","nezadán","bez","S",1965]
[899,"Tluka Jindrich","nezadán","bez","S",1957]
[900,"Ocenasek Jiri","nezadán","bez","S2",1954]
[901,"Pales Dusan","nezadán","bez","S",1960]
[902,"Szabo Milos","nezadán","bez","M",1968]
[903,"Strnadová Blanka","nezadán","bez","Se",1958]
[904,"Nykl Zdenek","nezadán","bez","S",1959]
[905,"Průchová Eliška","nezadán","bez","Se",1941]
[906,"Daněk Miroslav","nezadán","bez","S",1967]
[907,"Průcha Lumír","nezadán","bez","S2",1936]
[908,"Malík Milan","SK TEMPO Praha",4,"S2",1953]
[909,"Kolar Miroslav","nezadán","bez","S",1955]
[910,"Rezler Miroslav","nezadán","bez","S",1966]
[911,"Svoboda Vladimír","nezadán","bez","S2",1947]
[912,"Štambach Petr","nezadán","bez","S",1960]
[913,"Adamcova Monika","nezadán","bez","Se",1967]
[914,"Marešová Ilona","nezadán","bez","Se",1967]
[915,"Amtman Petr","nezadán","bez","S",1959]
[916,"Babic Radomir","nezadán","bez","M",1968]
[917,"Fako Roman","nezadán","bez","S",1966]
[918,"Hluch Petr","nezadán","bez","S",1960]
[919,"Hoc Vladimir","nezadán","bez","S",1962]
[920,"Juran Vladimir","nezadán","bez","S",1965]
[921,"Mrázek Peter","nezadán","bez","S",1967]
[922,"Suchy Jozef","nezadán","bez","S",1967]
[923,"Lorkova Ingrid","nezadán","bez","Se",1965]
[924,"Hermanek Petr","nezadán","bez","S",1965]
[925,"Linkova Veronika","nezadán","bez","Se",1964]
[926,"Krystof Jiri","nezadán","bez","S",1964]
[927,"Herejk Miroslav","nezadán","bez","S",1967]
[928,"Holzelova Ivana","nezadán","bez","Se",1960]
[929,"Vorech Jaroslav","nezadán","bez","S",1959]
[930,"Zalman Ladislav","nezadán","bez","S2",1954]
[931,"Boch Jiří","ANH Praha","bez","S",1966]
[932,"Čechová Libuše","MGC Olomouc","bez","Se",1954]
[933,"Vrkoc Jiri","nezadán","bez","S",1960]
[934,"Vrkocova Blanka","nezadán","bez","Se",1960]
[935,"Sauer Milan","nezadán","bez","S",1955]
[936,"Cap Pavel","nezadán","bez","S2",1953]
[937,"Kopeček Lumír","MGC ´90 Brno","bez","M",1968]
[938,"Mikulenková Marcela","nezadán","bez","Se",1966]
[939,"Mikulenka Petr","Start Kopřivnice",4,"M",1968]
[940,"Lemeckova Lucie","nezadán","bez","Se",1966]
[941,"Leitnerova Monika","nezadán","bez","Se",1966]
[942,"Blazek Petr","nezadán","bez","S",1963]
[943,"Horecký Josef","MG SEBA Tanvald","bez","S2",1934]
[944,"Niederle Pavel","nezadán","bez","M",1968]
[945,"Kalaba Jozef","nezadán","bez","S",1963]
[946,"Holik Miroslav","nezadán","bez","S2",1951]
[947,"Kalaba Milan","nezadán","bez","S",1966]
[948,"Melichercik Pavel","nezadán","bez","S",1963]
[949,"Kochman Frantisek","nezadán","bez","S2",1954]
[950,"Jelačič Eduard","ANH Praha","bez","M",1968]
[951,"Spáčil Jaroslav","KDG Šternberk","bez","M",1972]
[952,"Kubík Josef","SKDG Příbor",1,"S2",1951]
[953,"Janík Jiří","MGC Hradečtí Orli","bez","M",1969]
[954,"Bečka Stanislav","SK DG Chomutov","bez","S",1962]
[955,"Masek Robert","nezadán","bez","S",1962]
[956,"Hosek Martin","nezadán","bez","S",1962]
[957,"Skrivankova Zuzana","nezadán","bez","Se",1960]
[958,"Stejskal Oldrich","nezadán","bez","S",1966]
[959,"Svarc Jiri","nezadán","bez","M",1969]
[960,"Pavelková Petra","nezadán","bez","Se",1966]
[961,"Vobora Miroslav","nezadán","bez","S2",1954]
[962,"Makovec Josef","MGC Dráčata Pečky",5,"S",1966]
[963,"Schafferova Eva","nezadán","bez","Se",1960]
[964,"Kucerova Jolana","nezadán","bez","Se",1965]
[965,"Langmaier Tomáš","nezadán","bez","M",1970]
[966,"Doka Peter","nezadán","bez","S",1966]
[967,"Pinos Rastislav","nezadán","bez","S",1967]
[968,"Kutalek Lubomir","nezadán","bez","S2",1953]
[969,"Radic Igor","nezadán","bez","S",1961]
[970,"Zwirzina Otto","nezadán","bez","S2",1944]
[971,"Mikulka Erik","nezadán","bez","M",1977]
[972,"Vokacova Eva","nezadán","bez","Se",1961]
[973,"Gerža Jaroslav","KDG Šternberk","bez","S2",1952]
[974,"Jirotka Vladimir","nezadán","bez","S2",1922]
[975,"Jirotkova Ruzena","nezadán","bez","Se",1921]
[976,"Kalnik Ladislav","nezadán","bez","S",1962]
[977,"Komorova Jana","nezadán","bez","Se",1967]
[978,"Trnka Vaclav","nezadán","bez","S",1960]
[979,"Trnkova Eva","nezadán","bez","Se",1960]
[980,"Kasik Milan","nezadán","bez","M",1969]
[981,"Žoch Svatomír","TJ UNEX Uničov","bez","S2",1954]
[982,"Šeliga Zdeněk","nezadán","bez","S",1963]
[983,"Kubíková Danuše","nezadán","bez","Z",1974]
[984,"Hradilova Bohumila","nezadán","bez","Se",1966]
[985,"Kunzendörferová Irena","SKDG Jesenice","bez","Se",1942]
[986,"Vosmíková Petra","GC 85 Rakovník",1,"Z",1974]
[987,"Kubíková Eva","MGC Hradečtí Orli","bez","Se",1960]
[988,"Culak Eduard","nezadán","bez","S2",1950]
[989,"Stanovic Peter","nezadán","bez","S2",1954]
[990,"Bzoch Jozef","nezadán","bez","S",1957]
[991,"Culak Miroslav","nezadán","bez","S",1955]
[992,"Ondris Jan","nezadán","bez","S2",1943]
[993,"Barek Frantisek","nezadán","bez","S2",1953]
[994,"Brozovska Sarka","nezadán","bez","Z",1969]
[995,"Tureckova Lenka","nezadán","bez","Z",1970]
[996,"Slehofer Karel","nezadán","bez","S2",1954]
[997,"Kropsova Milada","nezadán","bez","Se",1956]
[998,"Janecek Frantisek","nezadán","bez","S2",1949]
[999,"Volek Martin","nezadán","bez","M",1970]
[1000,"Kabatová Jaroslava","nezadán","bez","Z",1973]
[1001,"Sevcik Marian","nezadán","bez","S2",1954]
[1002,"Boda Peter","nezadán","bez","M",1971]
[1003,"Budil Peter","nezadán","bez","M",1972]
[1004,"Cambal Roman","nezadán","bez","M",1969]
[1005,"Karnas Andrej","nezadán","bez","M",1972]
[1006,"Mazalová Petra","KDG Šternberk","bez","Z",1971]
[1007,"Dufek Marcel","nezadán","bez","S",1965]
[1008,"Duris Jiri","nezadán","bez","S",1965]
[1009,"Bauer Libor","nezadán","bez","S",1962]
[1010,"Lokajicek Tomas","nezadán","bez","M",1973]
[1011,"Dusíková Lenka","ANH Praha","bez","Se",1961]
[1012,"Zatloukalova Eva","nezadán","bez","Se",1964]
[1013,"Molcar Vaclav","nezadán","bez","S",1961]
[1014,"Barcalova Martina","nezadán","bez","Se",1964]
[1015,"Prochazka Jaroslav","nezadán","bez","S",1959]
[1016,"Löffelmann René","SMG 2000 Ústí n. L.","bez","M",1968]
[1017,"Lebduska Roman","nezadán","bez","S",1966]
[1018,"Secky Miroslav","nezadán","bez","S2",1953]
[1019,"Sindler Roman","nezadán","bez","S",1961]
[1020,"Schicht Jiří","DDM Praha 7","bez","S",1962]
[1021,"Sindlerova Marie","nezadán","bez","Se",1963]
[1022,"Zatloukal Petr","nezadán","bez","S",1959]
[1023,"Kopta Cestmir","nezadán","bez","S",1957]
[1024,"Jahn Milan","nezadán","bez","S",1959]
[1025,"Churan Zdenek","nezadán","bez","S",1961]
[1026,"Vanek Ales","nezadán","bez","S",1960]
[1027,"Faust Jaroslav","nezadán","bez","S2",1953]
[1028,"Zatloukal Igor","nezadán","bez","S",1958]
[1029,"Zatloukalova Jana","nezadán","bez","Se",1962]
[1030,"Pokorný Bohumil","GC 85 Rakovník","M","S",1959]
[1031,"Žurek Jiří","MGC Opava","bez","S2",1954]
[1032,"Klásek Ivo","MGC Opava","bez","S",1961]
[1033,"Pavela Milan","MGC Opava","bez","S",1965]
[1034,"Dubrovay Marian","nezadán","bez","S",1962]
[1035,"Masaryk Jozef","nezadán","bez","S2",1950]
[1036,"Kejda Zbynek","nezadán","bez","M",1972]
[1037,"Podloucky Josef","nezadán","bez","M",1973]
[1038,"Cvrkova Blanka","nezadán","bez","Se",1954]
[1039,"Šuba Petr","nezadán","bez","M",1973]
[1040,"Láník Jan","MGC Jedovnice",1,"S",1967]
[1041,"Jancik Ales","nezadán","bez","M",1971]
[1042,"Frelich Frantisek","nezadán","bez","S",1960]
[1043,"Fridrich Křešimír","nezadán","bez","S2",1934]
[1044,"Dolak Adolf","nezadán","bez","S",1964]
[1045,"Banduric Michal","nezadán","bez","S",1963]
[1046,"Bakala Vaclav","nezadán","bez","S",1964]
[1047,"Zapletalova Hana","nezadán","bez","Z",1969]
[1048,"Pernicova Lenka","nezadán","bez","Z",1969]
[1049,"Fridrichová Františka","nezadán","bez","Se",1931]
[1050,"Adamcikova Antonie","nezadán","bez"]
[1051,"Zubač Petr","nezadán","bez","S",1956]
[1052,"Zouhar Ales","nezadán","bez","M",1971]
[1053,"Šindler Jiří","Taurus Prostějov","bez","S2",1937]
[1054,"Surma Pavel","nezadán","bez","S",1957]
[1055,"Novak Jiri","nezadán","bez","S",1955]
[1056,"Smola Michal","nezadán","bez","M",1968]
[1057,"Bradac Jiri","nezadán","bez","M",1970]
[1058,"Hlaváč Zdeněk","KDG 2000 Ostrava",1,"S",1957]
[1059,"Bednář Jiří","MGC ´90 Brno",1,"S",1966]
[1060,"Burzik Ivan","nezadán","bez","S2",1953]
[1061,"Miscik Ladislav","ANH Praha","bez","S",1965]
[1062,"Serbin Frantisek","ANH Praha","bez","S",1962]
[1063,"Pribyl Daniel","nezadán","bez","M",1971]
[1064,"Simkanin Peter","nezadán","bez","S",1964]
[1065,"Duck Milan","nezadán","bez","S",1958]
[1066,"Spidla Patrik","nezadán","bez","S",1966]
[1067,"Sychra Dag","nezadán","bez","M",1969]
[1068,"Vancura Zdenek","nezadán","bez","M",1970]
[1069,"Prerost Miroslav","nezadán","bez","M",1969]
[1070,"Cajthamlova Hana","nezadán","bez","Se",1961]
[1071,"Ticháček Miroslav","MG SEBA Tanvald",2,"S2",1954]
[1072,"Vetrak Jan","nezadán","bez","S",1967]
[1073,"Proksova Blanka","nezadán","bez","Z",1975]
[1074,"Pasevová Jana","SK DG Chomutov","bez","Se",1966]
[1075,"Řádek Zdeněk","nezadán","bez","S2",1944]
[1076,"Stanek Petr","nezadán","bez","S",1966]
[1077,"Klvaňa Daniel","MGC ´90 Brno","bez","S",1962]
[1078,"Složil Petr","TJ Start Brno",2,"S",1962]
[1079,"Zofova Radka","nezadán","bez","Se",1966]
[1080,"Zadrazilova Miloslava","nezadán","bez","Se",1954]
[1081,"Kazda Frantisek","nezadán","bez","M",1969]
[1082,"Bergman Vaclav","nezadán","bez","S",1956]
[1083,"Skoupý Zdeněk","nezadán","bez","S",1958]
[1084,"Palkovský Marek","KGB Kojetín","bez","M",1969]
[1085,"Mlcoch Karel","nezadán","bez","M",1968]
[1086,"Prerost Karel","nezadán","bez","S",1963]
[1087,"Racansky Jaroslav","nezadán","bez","M",1969]
[1088,"Zezulka Pavel","MGC Hradečtí Orli","bez","S",1957]
[1089,"Zapletalova Karla","nezadán","bez","Se",1965]
[1090,"Kralikova Hana","nezadán","bez","Se",1964]
[1091,"Simek Michal","nezadán","bez","M",1971]
[1092,"Silny Pavel","nezadán","bez","S",1966]
[1093,"Trdlica Viktor","nezadán","bez","M",1969]
[1094,"Póč Miroslav","KGB Kojetín","bez","S",1962]
[1095,"Šajner Radek","nezadán","bez","M",1968]
[1096,"Lorenc Karel","nezadán","bez","S2",1953]
[1097,"Kovář Luboš","GC 85 Rakovník","bez","S",1960]
[1098,"Řehák Jaroslav","GC 85 Rakovník","M","S",1961]
[1099,"Bláha Milan","GC 85 Rakovník",2,"S",1958]
[1100,"Andr Zdeněk","GC 85 Rakovník","M","S",1956]
[1101,"Souček Milan","GC 85 Rakovník",1,"S",1960]
[1102,"Vosmík Petr","GC 85 Rakovník",2,"M",1968]
[1103,"Novotny Ludek","nezadán","bez","S",1967]
[1104,"Tasi Martin","nezadán","bez","M",1970]
[1105,"Pavelka Jaroslav","KGB Kojetín","bez","S",1962]
[1106,"Donat Martin","nezadán","bez","M",1971]
[1107,"Culakova Valeria","nezadán","bez","Se",1951]
[1108,"Culakova Gabriela","nezadán","bez","Z",1971]
[1109,"Spal Jaroslav","nezadán","bez","S2",1951]
[1110,"Polacek Miroslav","nezadán","bez","S",1967]
[1111,"Gogola Martin","nezadán","bez","M",1968]
[1112,"Kadlčák Libor","nezadán","bez","S2",1952]
[1113,"Lisa Miroslav ml.","SKDG Jesenice",2,"M",1975]
[1114,"Macek Vojtěch","KDG Tovačov","bez","M",1973]
[1115,"Soldan Petr","nezadán","bez","M",1969]
[1116,"Kantor Dušan","1. MGC Děkanka Praha","bez","S2",1943]
[1117,"Moudry Dalibor","nezadán","bez","M",1971]
[1118,"Marek Petr","nezadán","bez","M",1971]
[1119,"Zacek Miroslav","nezadán","bez","M",1970]
[1120,"Sliva Pavel","nezadán","bez","M",1971]
[1121,"Vermirovsky Milan","nezadán","bez","M",1971]
[1122,"Hrehus Ludovit","nezadán","bez","M",1969]
[1123,"Struhar Peter","nezadán","bez","M",1968]
[1124,"Kiaba Daniel","nezadán","bez","M",1968]
[1125,"Matejka Lubos","nezadán","bez","M",1970]
[1126,"Poliak Norbert","nezadán","bez","M",1970]
[1127,"Vojtko Rudolf","nezadán","bez","S",1967]
[1128,"Marcinak Lubomir","nezadán","bez","S",1966]
[1129,"Komaromi Jan","nezadán","bez","S",1964]
[1130,"Matuska Peter","nezadán","bez","M",1969]
[1131,"Rumanovsky Henrich","nezadán","bez","S",1960]
[1132,"Svoboda Petr","nezadán","bez","M",1969]
[1133,"Saro Ivo","GC 85 Rakovník","bez","S",1960]
[1134,"Vitner Václav","GC 85 Rakovník",2,"S",1957]
[1135,"Lev Pavel","GC 85 Rakovník","bez","S",1962]
[1136,"Černý Vladimír","GC 85 Rakovník","bez","S",1956]
[1137,"Maxova Leona","nezadán","bez","Se",1963]
[1138,"Malicek Petr","nezadán","bez","M",1972]
[1139,"Faltynek Zdenek","nezadán","bez","M",1974]
[1140,"Indrák Miroslav","MGC Olomouc","bez","M",1972]
[1141,"Sulc Jiri","nezadán","bez","M",1970]
[1142,"Bzoch Jan","nezadán","bez","S",1961]
[1143,"Babusek Jozef","nezadán","bez","S2",1954]
[1144,"Precuch Peter","nezadán","bez","S",1964]
[1145,"Rygr Martin","MGC Holešov","bez","M",1971]
[1146,"Kuchař Jan","nezadán","bez","M",1975]
[1147,"Kubik Stanislav","nezadán","bez","S",1955]
[1148,"Šalátová Alena","nezadán","bez","Se",1954]
[1149,"Koča Martin","GC 85 Rakovník","bez","M",1975]
[1150,"Beran Robert","SKGC Frant. Lázně",3,"S",1966]
[1151,"Fucik Zdenek","nezadán","bez","S",1962]
[1152,"Glejdura Petr","nezadán","bez","M",1971]
[1153,"Stavka Miroslav","nezadán","bez","M",1974]
[1154,"Novák Václav","nezadán","bez","S",1956]
[1155,"Vilímek Ivan","nezadán","bez","S",1963]
[1156,"Malík David","SK TEMPO Praha",2,"M",1976]
[1157,"Cizek Frantisek","nezadán","bez","S",1956]
[1158,"Mouchova Dagmar","nezadán","bez","Z",1972]
[1159,"Vanecek Petr","nezadán","bez","M",1975]
[1160,"Badžová Simona","nezadán","bez","Z",1975]
[1161,"Netopil Jan","MGC Olomouc",2,"M",1976]
[1162,"Navratil Jaroslav","nezadán","bez","S",1960]
[1163,"Hejna Lubor","MGC ´90 Brno","bez","S",1957]
[1164,"Václavek Aleš","nezadán","bez","S",1964]
[1165,"Jonášová Anna","MGC ´90 Brno","bez","Se",1964]
[1166,"Pohořelý Vladimír","nezadán","bez","S",1964]
[1167,"Trelová Vladimíra","nezadán","bez","Se",1965]
[1168,"Barvik Richard","MGC Opava","bez","S",1965]
[1169,"Kováč Roman","nezadán","bez","S",1960]
[1170,"Placek Libor","nezadán","bez","M",1969]
[1171,"Pekárková Dana","MGT PLUPO Vratimov","bez","Z",1974]
[1172,"Foukalová Petra","nezadán","bez","Z",1971]
[1173,"Nehera Milan","Taurus Prostějov","bez","S",1964]
[1174,"Chovanec Marian","nezadán","bez","M",1971]
[1175,"Weisenpacher Richard","nezadán","bez","M",1971]
[1176,"Adamcak Jan","nezadán","bez","M",1970]
[1177,"Galatik Martin","nezadán","bez","M",1972]
[1178,"Domanský Pavel","nezadán","bez","M",1970]
[1179,"Rygr Miroslav","TJ Bystřice p. H.","bez","S",1966]
[1180,"Kučera Radek","nezadán","bez","M",1968]
[1181,"Pesek Petr","nezadán","bez","S",1964]
[1182,"Pithart Ivan","nezadán","bez","S",1959]
[1183,"Pešek Jaroslav st.","MGK Spartak Příbram","bez","S",1962]
[1184,"Cambalova Zuzana","nezadán","bez","Z",1969]
[1185,"Vicar Vaclav","nezadán","bez","M",1970]
[1186,"Bubik Bohumir","nezadán","bez","S",1961]
[1187,"Vitásek Petr","MGK Spartak Příbram","bez","S",1961]
[1188,"Hanzal Jiří","nezadán","bez","S",1962]
[1189,"Hanzal Michal","DDM Praha 7","bez","M",1986]
[1190,"Zouhar Marek","nezadán","bez","M",1975]
[1191,"Zouhar Josef","nezadán","bez","S2",1948]
[1192,"Recova Lenka","nezadán","bez","Se",1966]
[1193,"Hanakova Ivana","nezadán","bez","Se",1965]
[1194,"Honzirek Richard","nezadán","bez","S",1967]
[1195,"Drahosova Radka","nezadán","bez","Se",1961]
[1196,"Bartonek Martin","nezadán","bez","M",1969]
[1197,"Krejci Petr","nezadán","bez","S",1967]
[1198,"Pekar Jaroslav","nezadán","bez","S",1963]
[1199,"Ondrus Radomir","nezadán","bez","M",1973]
[1200,"Buricova Marie","nezadán","bez","Se",1966]
[1201,"Kotrba David","nezadán","bez","M",1976]
[1202,"Kotrbova Iveta","nezadán","bez","Z",1974]
[1203,"Tománek Martin","MGC Hradečtí Orli","bez","M",1971]
[1204,"Misterka Marek","nezadán","bez","M",1970]
[1205,"Lazar Jan","nezadán","bez","M",1975]
[1206,"Lazar Josef","nezadán","bez","M",1972]
[1207,"Mrhálek Michal","nezadán","bez","M",1973]
[1208,"Plestil Milan","nezadán","bez","S",1964]
[1209,"Brenik Petr","nezadán","bez","S",1957]
[1210,"Koutsky Ladislav","nezadán","bez","M",1969]
[1211,"Tosovsky Petr","nezadán","bez","S",1964]
[1212,"Trnka Jiří","MGC Plzeň","bez","M",1973]
[1213,"Sebesta Pavel","nezadán","bez","M",1969]
[1214,"Bauerova Zdenka","nezadán","bez","Se",1967]
[1215,"Jochman Richard","nezadán","bez","S",1967]
[1216,"Netopil František","nezadán","bez","S2",1940]
[1217,"Kovacik Jozef","nezadán","bez","S",1960]
[1218,"Bus Ivan","nezadán","bez","S",1964]
[1219,"Skoda Ivan","nezadán","bez","S",1963]
[1220,"Havlík Petr","nezadán","bez","S",1964]
[1221,"Jagersky Maros","nezadán","bez","M",1970]
[1222,"Struhar Juraj","nezadán","bez","M",1970]
[1223,"Severa Vladimir","nezadán","bez","M",1975]
[1224,"Blaheta Jiri","nezadán","bez","S2",1940]
[1225,"Blaheta Roman","nezadán","bez","M",1970]
[1226,"Caithaml Jan","nezadán","bez","S",1961]
[1227,"Stankova Dana","nezadán","bez","Z",1968]
[1228,"Stanko Tomas","nezadán","bez","M",1970]
[1229,"Spěvák František","nezadán","bez","S2",1944]
[1230,"Metelka Dušan","nezadán","bez","M",1972]
[1231,"Istvan Marian","nezadán","bez","S",1961]
[1232,"David Petr","nezadán","bez","M",1969]
[1233,"Kuffa Kurt","nezadán","bez","S",1967]
[1234,"Slavik Emanuel","nezadán","bez","M",1970]
[1235,"Steinbach Josef","nezadán","bez","S",1967]
[1236,"Hřebíček Miroslav","nezadán","bez","S",1967]
[1237,"Šmíd Karel","nezadán","bez","S",1964]
[1238,"Hubka Martin","nezadán","bez","M",1971]
[1239,"Doležel Ivan","1. DGC Bystřice p. H.",3,"M",1968]
[1240,"Doležel Pavel","1. DGC Bystřice p. H.",2,"M",1973]
[1241,"Doležel Radek st.","MGC Holešov","M","M",1970,"host. - 1. DGC Bystřice p.H."]
[1242,"Mikulík Oldřich","1. DGC Bystřice p. H.",4,"S2",1949]
[1243,"Neradil Vladimír","1. DGC Bystřice p. H.","bez","M",1970]
[1244,"Stračinský Bedřich","TJ Bystřice p. H.","bez","S",1962]
[1245,"Tesař Miroslav","TJ Bystřice p. H.","bez","S2",1921]
[1246,"Dvornik David","nezadán","bez","M",1970]
[1247,"Vysloužilová Šárka","nezadán","bez","Z",1970]
[1248,"Jansa Michal","1. DGC Bystřice p. H.","bez","M",1976]
[1249,"Nečekal František ml.","TJ MG Cheb",1,"M",1980]
[1250,"Nečekal Marek","TJ MG Cheb",3,"M",1979]
[1251,"Dolezel Karel","nezadán","bez","M",1970]
[1252,"Hradil Svatopluk","TJ Bystřice p. H.","bez","S",1961]
[1253,"Hajný Petr","MGC Hradečtí Orli","bez","M",1974]
[1254,"Petras Martin","nezadán","bez","M",1970]
[1255,"Korinek Marcel","nezadán","bez","M",1970]
[1256,"Sobolic Milan","nezadán","bez","S2",1949]
[1257,"Kučera Adolf","nezadán","bez","S",1963]
[1258,"Viktora Jan","nezadán","bez","S",1966]
[1259,"Kaska Radek","žádný","bez","M",1972]
[1260,"Zakova Adriana","nezadán","bez","Z",1970]
[1261,"Zakova Dagmar","nezadán","bez","Z",1970]
[1262,"Soldan Peter","nezadán","bez","S",1957]
[1263,"Zelenaj Boris","nezadán","bez","M",1975]
[1264,"Slovak Jaroslav","nezadán","bez","M",1968]
[1265,"Vavro Jozef","nezadán","bez","M",1975]
[1266,"Gavlas Miroslav","nezadán","bez","M",1968]
[1267,"Papousek Pavel","nezadán","bez","S",1961]
[1268,"Mikulík Jaroslav","TJ Bystřice p. H.","bez","S",1967]
[1269,"Dočkal Radek","TJ Bystřice p. H.","bez","M",1968]
[1270,"Ziduv Petr","nezadán","bez","S2",1947]
[1271,"Skoda Miroslav","nezadán","bez","S",1963]
[1272,"Haidelmeier Juraj","nezadán","bez","S",1965]
[1273,"Skoda Jaroslav","nezadán","bez","S",1962]
[1274,"Ryslink Pavel ml","nezadán","bez","S",1966]
[1275,"Severová Marcela","MGC ´90 Brno","bez","Se",1966]
[1276,"Otta Martin","nezadán","bez","M",1971]
[1277,"Justiz Pavel","nezadán","bez","M",1970]
[1278,"Gruncl Josef","SKDG Jesenice",3,"S",1965]
[1279,"Bogdova Pavlina","nezadán","bez","Se",1966]
[1280,"Neugebauer Jaroslav","MGC Hradečtí Orli","bez","S",1961]
[1281,"Liskovec Jiri","nezadán","bez","M",1971]
[1282,"Firman Petr","nezadán","bez","M",1975]
[1283,"Bucek Richard","nezadán","bez","M",1970]
[1284,"Škubal Vladimír","MGC Plzeň",3,"S",1959]
[1285,"Blaha Karel","nezadán","bez","S",1957]
[1286,"Lazar Josef st.","nezadán","bez","S2",1920]
[1287,"Spacil Miroslav","nezadán","bez","S",1963]
[1288,"Švihel Karel","nezadán","bez","S",1955]
[1289,"Reitspies Miroslav","nezadán","bez","S",1964]
[1290,"Pauza Josef","SK DG Chomutov","bez","S2",1953]
[1291,"Urbancová Ludmila","TJ Bystřice p. H.","bez","Z",1972]
[1292,"Bilikova Dana","nezadán","bez","Z",1970]
[1293,"Volny Milan","nezadán","bez","S2",1944]
[1294,"Prousek Martin","MG SEBA Tanvald","bez","M",1971]
[1295,"Nepimach Luboš ml.","MG SEBA Tanvald",5,"M",1973]
[1296,"Péč Ladislav","MG SEBA Tanvald","bez","S2",1948]
[1297,"Klinkacek Milos","nezadán","bez","M",1976]
[1298,"Gregrova Jana","nezadán","bez","Z",1968]
[1299,"Apanasenkova Iva","nezadán","bez","Z",1968]
[1300,"Sedlacek Jan","nezadán","bez","S",1966]
[1301,"Majkus Zdeněk","SK TEMPO Praha",1,"M",1977]
[1302,"Kiml Martin","nezadán","bez","M",1976]
[1303,"Horcickova Iva","nezadán","bez","Z",1969]
[1304,"Rypl Pavel","nezadán","bez","S",1958]
[1305,"Potrebujes Jan","nezadán","bez","S",1966]
[1306,"Zemcak Ivo","nezadán","bez","M",1970]
[1307,"Waligora David","MGC Opava","bez","M",1973]
[1308,"Němec Miroslav","nezadán","bez","S",1966]
[1309,"Hradilová Taťána","TJ Bystřice p. H.","bez","Se",1962]
[1310,"Zháněl Miloslav","KGB Kojetín","bez","S",1962]
[1311,"Rezlerova Martina","nezadán","bez","Z",1969]
[1312,"Slánička Karel","nezadán","bez","M",1970]
[1313,"Seifert Miroslav","TJ Bystřice p. H.","bez","S",1962]
[1314,"Miskay Jozef","nezadán","bez","S2",1952]
[1315,"Rieger Radim","Start Kopřivnice",3,"M",1969]
[1316,"Hanak Marek","nezadán","bez","M",1970]
[1317,"Petrášek Milan","MGC Plzeň","bez","S",1965]
[1318,"Matýsek Aleš","nezadán","bez","S",1967]
[1319,"Medřík Vlastimil","nezadán","bez","S",1963]
[1320,"Biegl Pavel","MGC Hradečtí Orli","bez","S",1964]
[1321,"Parak Lubomir","nezadán","bez","M",1973]
[1322,"Gasperan Jan","nezadán","bez","S",1964]
[1323,"Valina Milan","nezadán","bez","M",1969]
[1324,"Drozda Zdeněk","SK DG Chomutov",3,"M",1978]
[1325,"Vavruskova Libuse","nezadán","bez","Z",1973]
[1326,"Struharova Jarmila","nezadán","bez","Z",1969]
[1327,"Kollarova Zuzana","nezadán","bez","Se",1960]
[1328,"Sekal Petr","nezadán","bez","S",1961]
[1329,"Safranek Otakar","nezadán","bez","S",1960]
[1330,"Jaros Frantisek","nezadán","bez","S",1962]
[1331,"Placek Tomas","nezadán","bez","S",1963]
[1332,"Kral Ivan","nezadán","bez","S",1955]
[1333,"Hojda Miroslav","nezadán","bez","S",1958]
[1334,"Jakl Josef","nezadán","bez","S2",1953]
[1335,"Havranek Petr","nezadán","bez","S2",1944]
[1336,"Skrabanek Jiri","nezadán","bez","S",1959]
[1337,"Brtnik Tomas","nezadán","bez","S",1964]
[1338,"Soucek Jiri","nezadán","bez","S",1962]
[1339,"Pobuda Antonín","nezadán","bez","S",1959]
[1340,"Jedlicka Zdenek","nezadán","bez","S2",1952]
[1341,"Cerny Milan","nezadán","bez","S",1956]
[1342,"Rubak Petr","nezadán","bez","S",1955]
[1343,"Zouharová Andrea","nezadán","bez","Z",1973]
[1344,"Slavickova Petra","nezadán","bez","Z",1968]
[1345,"Zwinger Jaromir","nezadán","bez","S",1966]
[1346,"Mašek Jindřich","nezadán","bez","S",1966]
[1347,"Ballak Karol","nezadán","bez","S",1964]
[1348,"Krska Vilem","nezadán","bez","S2",1945]
[1349,"Vacik Jiri","nezadán","bez","S",1956]
[1350,"Fanta Vaclav","nezadán","bez","S2",1940]
[1351,"Hodanek Pavel","nezadán","bez","S",1964]
[1352,"Vlček Jan","MGC Hradečtí Orli","bez","M",1977]
[1353,"Vlček Lukáš","1. MGC Děkanka Praha","bez","M",1977]
[1354,"Kusenda Vlastimil","nezadán","bez","M",1972]
[1355,"Hrabal Jiri","nezadán","bez","S",1965]
[1356,"Istvan Ladislav","nezadán","bez","M",1973]
[1357,"Koupil Marek","KDG Šternberk","bez","M",1975]
[1358,"Kovář Jiří","nezadán","bez","M",1976]
[1359,"Šrámek Karel","KDG Šternberk","bez","S",1965]
[1360,"Žákovský Marek","SK TEMPO Praha","bez","M",1972]
[1361,"Píša Martin","nezadán","bez","M",1971]
[1362,"Kubik Roman","nezadán","bez","M",1972]
[1363,"Tomankova Zuzana","SK OAZA","bez","Z",1973]
[1364,"Prochac Ivan","nezadán","bez","S",1965]
[1365,"Harsanyi Peter","nezadán","bez","S",1963]
[1366,"Hejny Ivo","nezadán","bez","M",1974]
[1367,"Stejskal Bedřich","SKGC Frant. Lázně",5,"S",1962]
[1368,"Kárný Libor","TJ Start Brno","bez","M",1971]
[1369,"Daněček Petr","TJ Bystřice p. H.","bez","M",1977]
[1370,"Škopík Zdeněk","MGC ´90 Brno","bez","M",1971]
[1371,"Broumský Miroslav","SK DG Chomutov","bez","M",1972]
[1372,"Broumský Jiří","TJ MG Cheb",2,"S",1967]
[1373,"Novotny Ladislav","nezadán","bez","S",1960]
[1374,"Kotas Vít","TJ Bystřice p. H.","bez","M",1973]
[1375,"Dvorník Marek","TJ Bystřice p. H.","bez","M",1975]
[1376,"Bílek David","MGC Olomouc",2,"M",1974]
[1377,"Slezák Šimon","MGC Hradečtí Orli","bez","M",1975]
[1378,"Fuglicek Roman","nezadán","bez","M",1970]
[1379,"Dvořák Jan","nezadán","bez","S",1959]
[1380,"Hauer Tomas","nezadán","bez","M",1973]
[1381,"Vala Petr","nezadán","bez","M",1975]
[1382,"Schreiber David","1. DGC Bystřice p. H.",5,"M",1972]
[1383,"Vaněk Martin","MGC Opava","bez","S",1967]
[1384,"Podhora Vladislav","nezadán","bez","S",1965]
[1385,"Baumel Vaclav","nezadán","bez","S2",1944]
[1386,"Gerža Michal","KDG Šternberk","bez","M",1977]
[1387,"Dočkal Lubomír st.","SKGC Frant. Lázně",4,"S",1958]
[1388,"Dočkalová Dana","SKGC Frant. Lázně","M","Se",1956]
[1389,"Polasek Marcel","nezadán","bez","M",1972]
[1390,"Svítivý Eduard","1. MGC Děkanka Praha","bez","S",1966]
[1391,"Katrencik Jan","nezadán","bez","S",1963]
[1392,"Rokos David","nezadán","bez","M",1977]
[1393,"Safar Petr","nezadán","bez","M",1978]
[1394,"Siegel Pavel","nezadán","bez","M",1976]
[1395,"Mládenka Tomáš","1. MGC Děkanka Praha",4,"S",1963]
[1396,"Hajný Petr","MGC Hradečtí Orli","bez","S2",1946]
[1397,"Vyška Radek","ME Blansko",4,"S",1963]
[1398,"Skoumal Svatopluk","nezadán","bez","S",1966]
[1399,"Necas Milos","nezadán","bez","M",1970]
[1400,"Kříž Jan","nezadán","bez","M",1970]
[1401,"Sury Jiri","nezadán","bez","S",1962]
[1402,"Hrivňák Ladislav","nezadán","bez","M",1972]
[1403,"Rimpler Jiří","MGC Jedovnice",2,"M",1971]
[1404,"Grim Jiří","nezadán","bez","S",1961]
[1405,"Doležel Jiří","KDG Šternberk","bez","M",1978]
[1406,"Sedivy Martin","nezadán","bez","M",1974]
[1407,"Vozár Josef","SK TEMPO Praha","M","S",1967]
[1408,"Kolář František","nezadán","bez","S2",1946]
[1409,"Budinec Igor","nezadán","bez","S",1967]
[1410,"Kořínek Jiří","nezadán","bez","S2",1946]
[1411,"Bedřich Jaroslav","KGB Kojetín","bez","S",1961]
[1412,"Burián David","nezadán","bez","M",1975]
[1413,"Seman Marek","nezadán","bez","M",1973]
[1414,"Murinova Jarmila","nezadán","bez","Se",1967]
[1415,"Brachacek David","nezadán","bez","M",1979]
[1416,"Fiedler Vladimír","SKGC Frant. Lázně",2,"M",1977]
[1417,"Fikar Petr","nezadán","bez","M",1975]
[1418,"Filip Miroslav","nezadán","bez","M",1979]
[1419,"Flégl František","nezadán","bez","M",1977]
[1420,"Gábor Pavel","nezadán","bez","M",1974]
[1421,"Hladký Jan","nezadán","bez","M",1975]
[1422,"Horacek Ivo","nezadán","bez","M",1976]
[1423,"Král Pavel","nezadán","bez","M",1975]
[1424,"Kratochvilova Helena","nezadán","bez","Se",1956]
[1425,"Kubr Jan","nezadán","bez","M",1976]
[1426,"Paták František","nezadán","bez","M",1976]
[1427,"Randis Petr","nezadán","bez","M",1977]
[1428,"Tomek Tomáš","nezadán","bez","M",1977]
[1429,"Zelenka Jaroslav","nezadán","bez","M",1977]
[1430,"Polony Michal","nezadán","bez","M",1974]
[1431,"Doleželová Lenka","1. DGC Bystřice p. H.",1,"Z",1973]
[1432,"Grunclová Marie","nezadán","bez","Z",1968]
[1433,"Hodinová Ingrid","nezadán","bez","Se",1945]
[1434,"Zušťák Jiří","nezadán","bez","S2",1952]
[1435,"Vejražka Alan","TJ MG Cheb","bez","S",1966]
[1436,"Hassa Martin","nezadán","bez","M",1968]
[1437,"Nesvadbík Petr","nezadán","bez","S",1963]
[1438,"Vrána Ladislav","nezadán","bez","S",1963]
[1439,"Rýdl Jaroslav","MG SEBA Tanvald","bez","S2",1923]
[1440,"Přibyl Aleš","MG SEBA Tanvald","bez","M",1971]
[1441,"Mazač Petr","nezadán","bez","M",1970]
[1442,"Kruta Vladimir","nezadán","bez","M",1973]
[1443,"Cerveny Petr","nezadán","bez","M",1973]
[1444,"Herdaniova Erika","nezadán","bez","Z",1973]
[1445,"Palicka Jan","nezadán","bez","M",1977]
[1446,"Duchek Bohdan","nezadán","bez","M",1971]
[1447,"Jagersky Jan","nezadán","bez","M",1968]
[1448,"Pucher Stefan","nezadán","bez","M",1970]
[1449,"Kosatko Josef","nezadán","bez","M",1977]
[1450,"Adam Jaroslav","MGC Plzeň",3,"M",1975]
[1451,"Alexa Pavel","nezadán","bez","S",1965]
[1452,"Svoboda Miroslav ml.","Start Kopřivnice","bez","M",1976]
[1453,"Vobratilova Rita","nezadán","bez","Z",1974]
[1454,"Fridrin Jiri","nezadán","bez","M",1970]
[1455,"Burian Daniel","nezadán","bez","M",1968]
[1456,"Leinert Ivan","KGB Kojetín","bez","S",1964]
[1457,"Capek Michal","nezadán","bez","M",1968]
[1458,"Vondruska Zbynek","nezadán","bez","M",1974]
[1459,"Korytak Zdenek","nezadán","bez","S",1964]
[1460,"Blaha Martin","nezadán","bez","M",1969]
[1461,"Kalina Vladimir","nezadán","bez","S",1967]
[1462,"Bieliková Dáša","nezadán","bez","Z",1971]
[1463,"Fryšták Zdeněk","TJ Bystřice p. H.","bez","M",1975]
[1464,"Svacina Filip","nezadán","bez","M",1977]
[1465,"Lastovka Petr","nezadán","bez","M",1976]
[1466,"Lapacek Jan","nezadán","bez","M",1978]
[1467,"Skala Petr","nezadán","bez","M",1978]
[1468,"Bendova Alena","nezadán","bez","Se",1934]
[1469,"Sezemsky Bohdan","nezadán","bez","M",1977]
[1470,"Drazan Jan","nezadán","bez","M",1977]
[1471,"Souskova Lucie","nezadán","bez","Z",1972]
[1472,"Hromek Erik","MGC Jedovnice","bez","M",1972]
[1473,"Jašík Radim","ME Blansko","bez","M",1973]
[1474,"Šmerda Pavel","ME Blansko","bez","M",1972]
[1475,"Safranek Jiri","nezadán","bez","S",1962]
[1476,"Korytak Frantisek","nezadán","bez","S",1962]
[1477,"Rous Zdeněk","nezadán","bez","S",1963]
[1478,"Fiedlerová Jaroslava","SKGC Frant. Lázně","M","Se",1947]
[1479,"Lintnerova Jitka","nezadán","bez","Z",1970]
[1480,"Mach Milan","nezadán","bez","M",1970]
[1481,"Charuza Vit","nezadán","bez","M",1971]
[1482,"Formankova Renata","nezadán","bez","Z",1973]
[1483,"Hlaváč Pavel","MGC Opava","bez","M",1973]
[1484,"Škrobánek René","nezadán","bez","M",1976]
[1485,"Ivanovic Lubomir","nezadán","bez","M",1975]
[1486,"Branis Eduard","nezadán","bez","S",1967]
[1487,"Marusincova Zuzana","nezadán","bez","Z",1972]
[1488,"Kuba Pavel","nezadán","bez","M",1977]
[1489,"Utikal David","nezadán","bez","M",1978]
[1490,"Adam Ladislav","nezadán","bez","S2",1951]
[1491,"Adam Petr","nezadán","bez","M",1975]
[1492,"Král Vladimír","nezadán","bez","M",1977]
[1493,"Kudr Michal","MGC Jedovnice","bez","M",1976]
[1494,"Jandák Zbyněk","nezadán","bez","M",1975]
[1495,"Papoušek Petr","MGC ´90 Brno",2,"M",1974]
[1496,"Girášek Pavel","nezadán","bez","M",1974]
[1497,"Schreiberová Lenka","MGT PLUPO Vratimov","bez","Z",1976]
[1498,"Proksova Andrea","nezadán","bez","Z",1977]
[1499,"Bauerová Renata","nezadán","bez","Se",1967]
[1500,"MeSeároSeová Monika","nezadán","bez","Z",1968]
[1501,"Gálová Renata","MGC Hradečtí Orli","bez","Z",1968]
[1502,"Babindak Dusan","nezadán","bez","S",1958]
[1503,"Swaczyna Pavel ml.","MGC Jedovnice","bez","M",1981]
[1504,"Chaloupka Jan","nezadán","bez","M",1972]
[1505,"Vyskala Jan","nezadán","bez","S",1966]
[1506,"Šalantai Lubor","nezadán","bez","M",1968]
[1507,"Bridlova Helena","nezadán","bez","Z",1969]
[1508,"Matulik Jaroslav","nezadán","bez","M",1971]
[1509,"Andres Jan","nezadán","bez","M",1977]
[1510,"Navrátil Tomáš","MGC Olomouc",3,"M",1978]
[1511,"Bílek Ctibor","TJ Bystřice p. H.","bez","M",1970]
[1512,"Macour David","nezadán","bez","M",1977]
[1513,"Bičan Martin","KDG Šternberk","bez","M",1979]
[1514,"Rumanovsky Robert","ANH Praha","bez","S",1960]
[1515,"Rozsypalova Barbora","nezadán","bez","Z",1973]
[1516,"Kucera Ales","nezadán","bez","M",1973]
[1517,"Bartl Robert","nezadán","bez","M",1973]
[1518,"Sedláček David","MGC Olomouc","bez","M",1978]
[1519,"Baliak Igor","nezadán","bez","M",1973]
[1520,"Durica Marian","nezadán","bez","M",1973]
[1521,"Šebela Marcel","MGC Jedovnice","bez","M",1977]
[1522,"Frydek Pavel","nezadán","bez","M",1973]
[1523,"Brozova Hana","nezadán","bez","Se",1955]
[1524,"Hybner Jaroslav","nezadán","bez","S",1963]
[1525,"Lizak Peter","nezadán","bez","M",1973]
[1526,"Špidra Marek","GC 85 Rakovník","bez","M",1976]
[1527,"Chalachan Igor","nezadán","bez","S",1960]
[1528,"Sedlák Jaroslav","nezadán","bez","S",1965]
[1529,"Hrachy Robert","MGC ´90 Brno","bez","S",1965]
[1530,"Lahner Pavel","nezadán","bez","S",1964]
[1531,"Zelenková Jana","nezadán","bez","Z",1975]
[1532,"Pokorný Michal","nezadán","bez","M",1979]
[1533,"Drabek Pavel","nezadán","bez","M",1978]
[1534,"Koudela Miroslav","nezadán","bez","S",1964]
[1535,"Mlcoch Karel","nezadán","bez","S2",1950]
[1536,"Pospíšil Petr","nezadán","bez","S",1965]
[1537,"Šmerda Kamil","ME Blansko","bez","M",1974]
[1538,"Vasir Jiri","nezadán","bez","M",1972]
[1539,"Pavelka Martin","nezadán","bez","M",1975]
[1540,"Janda Milan","nezadán","bez","S",1960]
[1541,"Skalický Roman","nezadán","bez","M",1971]
[1542,"Bystřický Tomáš","GC 85 Rakovník","bez","M",1972]
[1543,"Rada Tomáš","nezadán","bez","M",1976]
[1544,"Slanina Miroslav","nezadán","bez","S",1964]
[1545,"Kuhn Jakub","nezadán","bez","M",1982]
[1546,null,null,"bez"]
[1547,"Masár Luděk","nezadán","bez","M",1978]
[1548,"Bastl Bohumír","nezadán","bez","M",1976]
[1549,"Kánský Jiří","nezadán","bez","M",1975]
[1550,"Belka Ludek","nezadán","bez","M",1978]
[1551,"Ducký Jan","nezadán","bez","M",1977]
[1552,"Lehar Ota","nezadán","bez","M",1981]
[1553,"Kratochvíl Václav","MGC Plzeň","bez","M",1973]
[1554,"Krutil Radek","TJ Bystřice p. H.","bez","M",1973]
[1555,"Berka Tomas","nezadán","bez","M",1977]
[1556,"Berka Vlastimil","nezadán","bez","M",1968]
[1557,"Koutny Martin","nezadán","bez","M",1970]
[1558,"Buchta Kamil","KDG Šternberk","bez","M",1977]
[1559,"Král Martin","KDG Šternberk","bez","M",1975]
[1560,"Procházka Petr","nezadán","bez","M",1975]
[1561,"Kymlička Luděk","GC 85 Rakovník","bez"]
[1562,"Jadviščok Ladislav","nezadán","bez","M",1977]
[1563,"Kovář Jaromír","nezadán","bez","M",1975]
[1564,"Svaton Čeněk","ANH Praha","bez","M",1972]
[1565,"Vrátil Lukas","ANH Praha","bez","M",1974]
[1566,"Rejnek Vaclav","nezadán","bez","M",1972]
[1567,null,null,"bez"]
[1568,"Frkova Andela","nezadán","bez","Z",1968]
[1569,"Urban Pavel","nezadán","bez","M",1974]
[1570,"Marsalkova Petra","nezadán","bez","Z",1970]
[1571,"Dobrý Petr","KDG Šternberk","bez","M",1974]
[1572,"Pospíšil Pavel","KDG Šternberk","bez","S2",1943]
[1573,"Šatrová Zdenka","nezadán","bez","Se",1934]
[1574,"Lizak Frantisek","nezadán","bez","S",1965]
[1575,"Kopťák Michal","MGC Opava","bez","S",1965]
[1576,"Pircak Pavel","nezadán","bez","M",1968]
[1577,"Vysin Jiri","nezadán","bez","M",1973]
[1578,"Klingerová Renata","MG SEBA Tanvald","bez","Z",1972]
[1579,"Klíma Josef","nezadán","bez","S2",1949]
[1580,"Unzeitigová Renata","MGC ´90 Brno","bez","Z",1973]
[1581,"Vala Bretislav","DDM Praha 7","bez"]
[1582,"Dorn Petr","nezadán","bez"]
[1583,"Kurinec Vladimir","nezadán","bez","S",1967]
[1584,"Kůrka Josef","nezadán","bez","S",1965]
[1585,"Hubko Lubomir","nezadán","bez","S",1961]
[1586,"Bakeš Miloš","nezadán","bez","M",1974]
[1587,"Zdvorila Pavla","nezadán","bez","Z",1970]
[1588,"Hejkal Ladislav","nezadán","bez","S2",1954]
[1589,"Dvořák Václav","SMG 2000 Ústí n. L.","bez","S",1955]
[1590,"Pospisilova Kamila","nezadán","bez","Z",1977]
[1591,"Bachor Jiří","nezadán","bez","S",1960]
[1592,"Franc Radomír","nezadán","bez","M",1977]
[1593,null,null,"bez"]
[1594,"Vodvarka Pavel","nezadán","bez","M",1977]
[1595,"Jezdinský Aleš","MGC Hradečtí Orli","bez","M",1977]
[1596,null,null,"bez"]
[1597,"Hruška Michal","SK TEMPO Praha","bez","M",1977]
[1598,"Ptáček Pavel","MGC Hradečtí Orli","bez","M",1977]
[1599,"Linhart Ladislav","SK TEMPO Praha",3,"M",1979]
[1600,"Stroblík Martin","nezadán","bez","M",1974]
[1601,"Křivánek David","nezadán","bez","M",1973]
[1602,"Perglová Anděla","SMG 2000 Ústí n. L.","bez","Z",1968]
[1603,"Novotny Petr","nezadán","bez","M",1979]
[1604,"Samalova Eva","nezadán","bez","Se",1963]
[1605,"Lehocká Anna","SKDG Jesenice",4,"Se",1949]
[1606,"Waligorová Lenka","MGC Opava","bez","Z",1974]
[1607,"Cirkva Jan","nezadán","bez","M",1980]
[1608,"Urban Zdenek","nezadán","bez","M",1980]
[1609,"Fiser Jiri","nezadán","bez","M",1977]
[1610,"Langasek Jiri","nezadán","bez","M",1979]
[1611,"Kocinova Lenka","nezadán","bez","Z",1980]
[1612,"Lassig Petr","nezadán","bez","M",1972]
[1613,"Spican Radek","nezadán","bez","M",1980]
[1614,"Vávra Michal","nezadán","bez","M",1974]
[1615,"Buberník Jiří","KDG Šternberk","bez","M",1979]
[1616,"Knez Roman","nezadán","bez","M",1977]
[1617,"Bares Milan","ANH Praha","bez","S",1966]
[1618,"Parasin Dusan","ANH Praha","bez","M",1973]
[1619,"Bunda Viktor","nezadán","bez","M",1973]
[1620,"Zingr Frantisek","GC 85 Rakovník","bez","M",1970]
[1621,"Staněk Stanislav","GC 85 Rakovník","M","M",1970]
[1622,"Vltavská Pavlína","nezadán","bez","Z",1976]
[1623,"Prechtlová Michaela","MG SEBA Tanvald","bez","Z",1974]
[1624,"Ticháček Dominik","MG SEBA Tanvald","bez","M",1975]
[1625,"Hronovsky Michal","nezadán","bez","M",1980]
[1626,"Benesova Petra","nezadán","bez","Z",1978]
[1627,"Tomsu Svatopluk","nezadán","bez","M",1973]
[1628,"Lorenc Lukas","nezadán","bez","M",1980]
[1629,"Kramarova Zuzana","nezadán","bez","Z",1977]
[1630,"Soucek Petr","nezadán","bez","M",1978]
[1631,"Skopalík Marek","nezadán","bez","M",1981]
[1632,"Zídek Michal","nezadán","bez","M",1974]
[1633,"Kovar Ales","nezadán","bez","M",1971]
[1634,null,null,"bez"]
[1635,"Kastner Martin","nezadán","bez","M",1977]
[1636,"Smazik Rene","nezadán","bez","M",1970]
[1637,"Steinecker Juraj","nezadán","bez","M",1978]
[1638,"Vancova Slavka","nezadán","bez","Z",1975]
[1639,"Zapletal Aleš","TJ Bystřice p. H.","bez","M",1977]
[1640,"Klapal Jan","nezadán","bez","M",1977]
[1641,"Kuba Vaclav","nezadán","bez","M",1979]
[1642,"Kubova Marika","nezadán","bez","Z",1977]
[1643,"Klimentová Soňa","MGC Olomouc","bez","Z",1983]
[1644,"Krejci Zdenek","nezadán","bez","M",1978]
[1645,"Žalman Jan","nezadán","bez","M",1976]
[1646,"Buková Lucie","DDM Praha 7","bez","Z",1971]
[1647,"Machala Igor","nezadán","bez","M",1970]
[1648,"Toth Pavel","nezadán","bez","M",1971]
[1649,"Metelka Zbyněk","nezadán","bez","M",1981]
[1650,"Fischer Richard","SKDG Fortuna Radotín",2,"S",1965]
[1651,"Ječná Hana","SK OAZA","bez","Se",1967]
[1652,"Ječný Milan","SK TEMPO Praha",1,"S",1966]
[1653,"Komada Ondřej","SMG 2000 Ústí n. L.",2,"S2",1954]
[1654,"Liška Michal","SK TEMPO Praha",2,"M",1968]
[1655,"Růžička Jan","nezadán","bez","M",1974]
[1656,"Svoboda Tomáš","nezadán","bez","S",1966]
[1657,"Šulc Jan","SK OAZA","bez","S",1955]
[1658,"Tupý Miroslav","nezadán","bez","S",1965]
[1659,"Vondrák Michal","SK OAZA",4,"S",1956]
[1660,"Vondráková Milena","SK OAZA",3,"Se",1957]
[1661,"Horáček Michal","nezadán","bez","M",1984]
[1662,"Podraský Radim","nezadán","bez","M",1968]
[1663,"Řepka Zdeněk","nezadán","bez","S",1965]
[1664,"Wágner Zdeněk","nezadán","bez","S",1963]
[1665,"Buchta Štěpán","KDG Šternberk","bez","M",1973]
[1666,"Buchcar Pavol","nezadán","bez","M",1977]
[1667,"Kováč Milan","nezadán","bez","S",1959]
[1668,"Trnka Ladislav","Dian Viktorie Praha 8","bez","M",1980]
[1669,"Rejnková Markéta","nezadán","bez","Z",1975]
[1670,"Grünvald Jaroslav","1. MGC Děkanka Praha",4,"S",1955]
[1671,"Haratická Jana","MG SEBA Tanvald","bez","Se",1963]
[1672,"Klíma Robert","nezadán","bez","M",1970]
[1673,"Pálka Hynek","nezadán","bez","S",1960]
[1674,"Pospíšil Jan","nezadán","bez","S",1959]
[1675,"Bauer Jan","nezadán","bez","S",1965]
[1676,"Hrbáč Aleš","nezadán","bez","S",1966]
[1677,"Liška Miroslav","nezadán","bez","M",1975]
[1678,"Klučková Pavla","nezadán","bez","Se",1944]
[1679,"Stehlíková Ivana","nezadán","bez","Z",1974]
[1680,"Maděra Vlastmil","nezadán","bez","S",1960]
[1681,"Hrbáček Vlastimil","nezadán","bez","S",1960]
[1682,"Pešek Bohumil","nezadán","bez","M",1973]
[1683,"Juřičková Blanka","nezadán","bez","Se",1964]
[1684,"Zapletal Pavel","nezadán","bez","S",1964]
[1685,"Maixner Ladislav","nezadán","bez","S",1961]
[1686,"Václavek Petr","nezadán","bez","S",1966]
[1687,"Stejskal Leo","nezadán","bez","M",1981]
[1688,"Pálka Adam","nezadán","bez","M",1989]
[1689,"Dočkalová Jana","SKGC Frant. Lázně",1,"Z",1980]
[1690,"Bydžovský Jan","nezadán","bez","M",1979]
[1691,"Maier Jan","nezadán","bez","M",1970]
[1692,"Dudek Petr","nezadán","bez","M",1977]
[1693,"Stuchlík Zdeněk","nezadán","bez","S",1955]
[1694,null,null,"bez"]
[1695,"Lechner Alois","nezadán","bez","S",1961]
[1696,"Pelc Tomáš","nezadán","bez","M",1974]
[1697,"Veselý Lukáš","nezadán","bez","M",1977]
[1698,"Skácelík Jiří","nezadán","bez","M",1973]
[1699,"Útrata Martin","nezadán","bez","M",1977]
[1700,"Trneček Jaroslav","nezadán","bez","M",1980]
[1701,"Daneš Ondřej","nezadán","bez","M",1977]
[1702,"Kadleček Luboš","nezadán","bez","S",1963]
[1703,"Hexner Martin","nezadán","bez","M",1979]
[1704,"Měrková Andrea","nezadán","bez","Z",1972]
[1705,"Bohuš Peter","nezadán","bez","M",1974]
[1706,"Hutlák Henrich","nezadán","bez","M",1976]
[1707,"Pavlíček Peter","nezadán","bez","S",1967]
[1708,"Veselý Jan","nezadán","bez","M",1970]
[1709,"Veselý Ladislav","nezadán","bez","M",1970]
[1710,"Svoboda Martin","MGC ´90 Brno",1,"M",1975]
[1711,"Schreiberová Martina","MGT PLUPO Vratimov",4,"Z",1972]
[1712,"Šenkyřík Vít","MGC Jedovnice",3,"M",1978]
[1713,"Biskubič Bohdan","nezadán","bez","M",1977]
[1714,"Jurkovič Luboš","nezadán","bez","M",1977]
[1715,"Koreň Marcel","nezadán","bez","M",1981]
[1716,"Malec Patrik","nezadán","bez","M",1976]
[1717,"Štenda Marek","nezadán","bez","M",1977]
[1718,"Tarči Norbert","nezadán","bez","M",1969]
[1719,"Tesák Juraj","nezadán","bez","M",1977]
[1720,"Višacký Robert","nezadán","bez","M",1969]
[1721,"Stanco Jan","nezadán","bez","M",1978]
[1722,"Finda Martin","nezadán","bez","M",1977]
[1723,"Koukalová Kateřina","nezadán","bez","Z",1977]
[1724,"Vilímek Dušan","nezadán","bez","M",1970]
[1725,"Matušová Božena","1. DGC Bystřice p. H.","bez","Z",1979]
[1726,"Adam David","TJ Start Brno","bez","M",1979]
[1727,"Bláha Petr","ME Blansko","bez","M",1978]
[1728,"Kotora Petr","nezadán","bez","M",1977]
[1729,"Rak Antonín ing.","SK TEMPO Praha","bez","M",1969]
[1730,"Fajmanová Monika","nezadán","bez","Se",1965]
[1731,"Bartl Milan","nezadán","bez","M",1981]
[1732,"Zaleská Andrea","nezadán","bez","Z",1975]
[1733,"Krecl Mojmír","1. DGC Bystřice p. H.",3,"M",1979]
[1734,"Krepindlová Jana","nezadán","bez","Z",1976]
[1735,"Martínek Ivo","MGC Hradečtí Orli",1,"S",1963]
[1736,"Česák Lukáš","nezadán","bez","M",1978]
[1737,"Bártl Bohumil","KDG Šternberk","bez","S2",1952]
[1738,"Šotner Marek","nezadán","bez","M",1976]
[1739,"Dobrotková Jitka","nezadán","bez","Z",1975]
[1740,"Rubínová Alena","nezadán","bez","Se",1956]
[1741,"Matyáš Michal","nezadán","bez","S",1967]
[1742,"Gažík Milan","nezadán","bez","M",1981]
[1743,"Sojka David","nezadán","bez","M",1979]
[1744,"Juřička Vladimír","nezadán","bez","S",1965]
[1745,"Šaj Jiří","nezadán","bez","M",1977]
[1746,"Vala Jiří","nezadán","bez","M",1979]
[1747,"Král Miroslav","nezadán","bez","S",1964]
[1748,"Smutková Libuše","nezadán","bez","Z",1972]
[1749,"Vysloužil František","nezadán","bez","M",1979]
[1750,"Laštůvka Michal","KDG Šternberk","bez","M",1982]
[1751,"Švejda Ivan","nezadán","bez","S2",1942]
[1752,"Švejda Bronislav","nezadán","bez","M",1974]
[1753,"Rosický Mario","nezadán","bez","M",1969]
[1754,"Žucha Milan","nezadán","bez","M",1973]
[1755,"Orto Milan","nezadán","bez","S",1965]
[1756,"Bureš Zdeněk","KDG Tovačov",2,"M",1977]
[1757,"Heřmanský Jan","ANH Praha","bez","M",1977]
[1758,"Hrbáčková Martina","nezadán","bez","Z",1980]
[1759,"Novák Michal","nezadán","bez","M",1982]
[1760,"Novák Radovan","nezadán","bez","S",1960]
[1761,"Píša Radovan","nezadán","bez","M",1974]
[1762,"Vizina Adam","nezadán","bez","M",1981]
[1763,"Šembera Petr","nezadán","bez","M",1979]
[1764,"Štefl Ivo","nezadán","bez","M",1971]
[1765,"Zabořil Luboš","Taurus Prostějov","bez","S",1964]
[1766,"Andrássy Uboš","nezadán","bez","S",1961]
[1767,"Ďurnek Ján","nezadán","bez","M",1975]
[1768,"Kevický Karol","nezadán","bez","M",1973]
[1769,"Švec Ivan","nezadán","bez","S",1961]
[1770,"Vysloužilová Jarmila","nezadán","bez","Se",1962]
[1771,"Vysloužil Tomáš","MGC Hradečtí Orli","bez","M",1982]
[1772,"Brodský Jan","nezadán","bez","M",1980]
[1773,"Melichar Jan","nezadán","bez","M",1978]
[1774,"Heřmánková Taťána","nezadán","bez","Z",1968]
[1775,"Kremz Vladimír","nezadán","bez","S2",1953]
[1776,"Hanuška Milan","SK OAZA","bez","M",1974]
[1777,"Hanuška Petr","nezadán","bez","M",1970]
[1778,"Komadová Miroslava","SMG 2000 Ústí n. L.",2,"Se",1953]
[1779,"Šulcová Zuzana","SK OAZA","bez","Se",1963]
[1780,"Tupý Radek","SKDG Fortuna Radotín",2,"M",1972]
[1781,"Odehnal Jiří","nezadán","bez","M",1982]
[1782,"Petřík Karel","nezadán","bez","S",1957]
[1783,"Břicháček Daniel","MG SEBA Tanvald","bez","M",1982]
[1784,"Harcuba Michal","nezadán","bez","M",1979]
[1785,"Klimeš Karel","nezadán","bez","M",1978]
[1786,"Skoták Michal","nezadán","bez","M",1977]
[1787,"Fibír Pavel","SK DG Chomutov",3,"M",1974]
[1788,"Pustofková Renata","MGC Olomouc","bez","Se",1956]
[1789,"Ženčák Marek","nezadán","bez","M",1980]
[1790,"Kremzová Adéla","nezadán","bez","Z",1982]
[1791,"Dočkal Lubomír ml.","SKGC Frant. Lázně","bez","M",1984]
[1792,"Bystřická Adéla","GC 85 Rakovník","bez","Z",1973]
[1793,"Dušek Jiří","MGC Hradečtí Orli","bez","S2",1951]
[1794,"Jirásek Zdeněk","nezadán","bez","S2",1950]
[1795,"Hofman Petr","nezadán","bez","S",1956]
[1796,"Hofmanová Zuzana","nezadán","bez","Se",1959]
[1797,"Říha Martin","nezadán","bez","S",1964]
[1798,"Zadinová Jana","nezadán","bez","Z",1976]
[1799,"Fried Zdeněk","1. MGC Děkanka Praha",4,"S",1956]
[1800,"Metelková Jitka","Dian Viktorie Praha 8","bez","Se",1967]
[1801,"Unzeitigová Blanka","TJ UNEX Uničov","bez","Z",1977]
[1802,"Drábková Dagmar","nezadán","bez","Z",1980]
[1803,"Pohajda David","1. DGC Bystřice p. H.","bez","M",1980]
[1804,"Jehlář Pavel","nezadán","bez","M",1980]
[1805,"Kučera Martin","MGC Hradečtí Orli","bez","M",1977]
[1806,"Mrkus Lukáš","nezadán","bez","M",1980]
[1807,"Švéda Jiří","nezadán","bez","S",1963]
[1808,"Vaňek Lukáš","nezadán","bez","M",1981]
[1809,"Špicl Václav","nezadán","bez","M",1979]
[1810,"Němeček Petr","nezadán","bez","S",1963]
[1811,"Křivánek Pavel","nezadán","bez","M",1978]
[1812,"Hasal Libor","MGC Hradečtí Orli","bez","S",1962]
[1813,"Dědek Martin","nezadán","bez","M",1981]
[1814,"Techmann Ondřej","MGT PLUPO Vratimov","bez","M",1982]
[1815,"Techmann Jiří","MGC Olomouc",2,"S2",1946]
[1816,"Hanzl Filip","nezadán","bez","M",1980]
[1817,"Bušinová Kateřina","nezadán","bez","Z",1979]
[1818,"Doskočilová Tereza","Dian Viktorie Praha 8","bez","Z",1979]
[1819,"Švédová Iveta","nezadán","bez","Z",1972]
[1820,"Vogl Jiří","nezadán","bez","M",1977]
[1821,"Kondler Jiří","nezadán","bez","M",1975]
[1822,"Bušina Petr","nezadán","bez","M",1978]
[1823,"Kadlčík Marek","nezadán","bez","M",1976]
[1824,"Patlejch Jaroslav","nezadán","bez","M",1981]
[1825,"Nelešovská Michaela","TJ Bystřice p. H.","bez","Z",1980]
[1826,"Kopťák Roman","MGC Opava","bez","S",1967]
[1827,"Trn Jiří","KDG Šternberk","bez","M",1981]
[1828,"Hujer Petr","nezadán","bez","M",1979]
[1829,"Kratochvílová Ludmila","nezadán","bez","Z",1976]
[1830,"Brůža Richard","MGC Hradečtí Orli","bez","M",1983]
[1831,"Velebil Pavel","nezadán","bez","M",1968]
[1832,"Smrčková Hana","nezadán","bez","Se",1955]
[1833,"Buryňák Luboš","nezadán","bez","M",1980]
[1834,"Landa Pavel","GC 85 Rakovník","bez","M",1979]
[1835,"Urbánek Michael","MGC ´90 Brno",1,"M",1972]
[1836,"Imrich Tomáš","MGC ´90 Brno","bez","M",1976]
[1837,"Knoflíček Ivo","MGC ´90 Brno","bez","M",1975]
[1838,"Nečesal Martin","MGC ´90 Brno","bez","M",1976]
[1839,"Janík Pavel","MGC ´90 Brno","bez","M",1976]
[1840,"Dorda Daniel","nezadán","bez","M",1981]
[1841,"Monsport David","nezadán","bez","M",1979]
[1842,"Pospíšil Robert","nezadán","bez","S",1961]
[1843,"Kolář Pavel","nezadán","bez","M",1978]
[1844,"Geržová Pavlína","MGC Olomouc",5,"Se",1965]
[1845,"Huml Pavel","nezadán","bez","M",1980]
[1846,"Melka Aleš","Taurus Prostějov","bez","M",1980]
[1847,"Hudeček Petr","nezadán","bez","M",1977]
[1848,"Hnízdil Vladislav","nezadán","bez","S",1962]
[1849,"Hájková Jitka","nezadán","bez","Z",1977]
[1850,"Cígl Lukáš","nezadán","bez","M",1981]
[1851,"Možný Pavel","nezadán","bez","M",1980]
[1852,"Šíbl Zbyněk","KDG Tovačov","bez","M",1980]
[1853,"Špidrová Martina","nezadán","bez","Z",1977]
[1854,"Rais Marek","nezadán","bez","M",1974]
[1855,"Hrejzková Lucie","nezadán","bez","Z",1976]
[1856,"Světlík Petr","nezadán","bez","M",1974]
[1857,"Šurýn Marek","nezadán","bez","M",1974]
[1858,"Vlasák Roman","SKDG Fortuna Radotín",2,"S",1966]
[1859,"Hederer Petr","nezadán","bez","S",1964]
[1860,"Žoch Ondřej","TJ UNEX Uničov","bez","M",1981]
[1861,"Nečekal Milan ml.","nezadán","bez","M",1973]
[1862,"Slezák Oldřich","nezadán","bez","M",1975]
[1863,"Novák Jiří","nezadán","bez","S2",1947]
[1864,"Nováková Hana","nezadán","bez","Se",1953]
[1865,"Koukalová Radka","nezadán","bez","Z",1985]
[1866,"Šišma Václav","KDG Šternberk","bez","M",1981]
[1867,"Bednařík Tomáš","nezadán","bez","M",1979]
[1868,"Nečekal Milan st.","TJ MG Cheb","bez","S2",1947]
[1869,"Polednová Eva","nezadán","bez","Z",1981]
[1870,"Bouda Michal","nezadán","bez","M",1980]
[1871,"Mařík Jan","nezadán","bez","M",1972]
[1872,"Picková Jana","nezadán","bez","Z",1971]
[1873,"Vaníček Jiří","nezadán","bez","S",1962]
[1874,"Vocelka Petr","nezadán","bez","S",1966]
[1875,"Vocelková Michaela","nezadán","bez","Z",1972]
[1876,"Hrbková Marcela","nezadán","bez","Se",1962]
[1877,"Lím Ivan","nezadán","bez","S2",1954]
[1878,"Lepič David","nezadán","bez","M",1979]
[1879,"Hrušková Nikol","nezadán","bez","Z",1983]
[1880,"Daniel Pavel","MGC Opava","bez","M",1969]
[1881,"Zapletal Pavel","nezadán","bez","M",1979]
[1882,"Jirásek Jiří","SK TEMPO Praha","bez","M",1978]
[1883,"Mojžíš Erik","nezadán","bez","M",1979]
[1884,"Valach Martin","nezadán","bez","M",1978]
[1885,"Hejhalová Olga","nezadán","bez","Z",1977]
[1886,"Šubrtová Daniela","nezadán","bez","Z",1977]
[1887,"Šedivá Gabriela","nezadán","bez","Z",1973]
[1888,"Koklar Adam","nezadán","bez","M",1984]
[1889,"Melichar Richard","nezadán","bez","M",1975]
[1890,"Dvořáček Mojmír","MGC ´90 Brno","bez","M",1975]
[1891,"Kučera Michael","MGC ´90 Brno","bez","M",1976]
[1892,"Pohanka Pavel","MGC ´90 Brno","bez","M",1978]
[1893,"Žaloudek Martin","MGC ´90 Brno",3,"M",1978]
[1894,"Marcinát Jan","nezadán","bez","M",1980]
[1895,"Šmejcký Oldřich","nezadán","bez","M",1984]
[1896,"Podmanický Jan","nezadán","bez","M",1984]
[1897,"Šustr Pavel","nezadán","bez","M",1975]
[1898,"Průcha Pavel ml.","nezadán","bez","M",1985]
[1899,"Jakubka Martin","nezadán","bez","M",1973]
[1900,"Zezulka David","nezadán","bez","M",1971]
[1901,"Bielik Marian","nezadán","bez","S",1967]
[1902,"Sedláček Břetislav","1. DGC Bystřice p. H.",1,"M",1980]
[1903,"Raková Renata","nezadán","bez","Z",1977]
[1904,"Hajn Martin","TJ Start Brno","bez","M",1985]
[1905,"Janíček Petr","nezadán","bez","M",1981]
[1906,"Semczuk Jan","nezadán","bez","M",1983]
[1907,"Heinc Michal","MGC ´90 Brno","bez","S2",1949]
[1908,"Svoboda Michal","nezadán","bez","M",1980]
[1909,"Uherec Miroslav","nezadán","bez","M",1979]
[1910,"Perat Martin","nezadán","bez","M",1972]
[1911,"Pouč Ondřej","nezadán","bez","M",1972]
[1912,"Adamec Marek","nezadán","bez","M",1977]
[1913,"Sladký Richard","nezadán","bez","M",1975]
[1914,"Meštrovič Vladimír","DDM Praha 7","bez","S",1967]
[1915,"Vojvoda Eugen","nezadán","bez","M",1970]
[1916,"Krobotová Lenka","nezadán","bez","Z",1979]
[1917,"Hanák Lukáš","nezadán","bez","M",1982]
[1918,"Báleš Martin","nezadán","bez","M",1968]
[1919,"Martínek Petr","nezadán","bez","M",1977]
[1920,"Moleková Miroslava","MG SEBA Tanvald","bez","Z",1978]
[1921,"Zamazalová Renata","MG SEBA Tanvald","bez","Z",1978]
[1922,"Klementa Miroslav","nezadán","bez","M",1970]
[1923,"Mucha Josef","MGC Jedovnice",5,"S",1955]
[1924,"Kříž Daniel","nezadán","bez","M",1971]
[1925,"Rada Stanislav","nezadán","bez","M",1973]
[1926,"Heinc Roman","MGC ´90 Brno","bez","M",1975]
[1927,"Heinl Jiří","MGC ´90 Brno","bez","M",1980]
[1928,"Nevrtal Tomáš","MGC ´90 Brno","bez","M",1979]
[1929,"Moskovská Iva","nezadán","bez","Z",1976]
[1930,"Klimš Jiří","nezadán","bez","M",1976]
[1931,"Nevrtal Radek","MGC ´90 Brno","bez","M",1981]
[1932,"Macková Hana","nezadán","bez","Z",1975]
[1933,"Swaczyna Pavel st.","KDG Šternberk","bez","S",1955]
[1934,"Gerža Pavel","MGC Olomouc","M","J",1994]
[1935,"Čejková Petra","nezadán","bez","Z",1976]
[1936,"Balcar David","MGC Opava","bez","M",1977]
[1937,"Kovalčík David","MGC Opava","bez","M",1971]
[1938,"Broum Jan","JR Golf Rychnov n. K.","bez","M",1980]
[1939,"Štanclová Monika","nezadán","bez","Z",1977]
[1940,"Strnad Jaroslav","nezadán","bez","S2",1939]
[1941,"Pletichová Jaroslava","nezadán","bez","Z",1983]
[1942,"Dostálová Kristina","nezadán","bez","Z",1984]
[1943,"Slánská Hana","nezadán","bez","Z",1978]
[1944,"Cončev Teodor","nezadán","bez","S2",1954]
[1945,"Techmann Michal","MGC Olomouc","bez","M",1977]
[1946,"Vavrečka Jan","nezadán","bez","M",1979]
[1947,"Sichrovský Artur","1. MGC Děkanka Praha","bez","S2",1952]
[1948,"Sichrovská Bronislava","1. MGC Děkanka Praha","bez","Se",1957]
[1949,"Moskovská Martina","nezadán","bez","Z",1978]
[1950,"Zimmer Denis","nezadán","bez","Se",1966]
[1951,"Pavlíček Josef","nezadán","bez","S",1955]
[1952,"Gregor Tomáš","GC 85 Rakovník","bez","M",1980]
[1953,"Kočvara Petr","nezadán","bez","M",1984]
[1954,"Kočvarová Klára","DDM Praha 7","bez","Z",1986]
[1955,"Špaček Pavel","MGC ´90 Brno","bez","S",1963]
[1956,"Mílek Michal","MGC ´90 Brno","bez","M",1981]
[1957,"Peterka Michal","MGC Jedovnice","bez","M",1975]
[1958,"Krejčí Pavel","MGC Jedovnice","bez","M",1972]
[1959,"Krejčí Martin","ME Blansko","bez","M",1973]
[1960,"Čech Luboš","MGC Jedovnice","bez","M",1976]
[1961,"Bukáček Roman","MGC ´90 Brno","bez","M",1974]
[1962,"Nečekalová Lenka","nezadán","bez","Z",1975]
[1963,"Mana Stanislav","KDG Šternberk","bez","M",1982]
[1964,"Šálek Miroslav","nezadán","bez","M",1976]
[1965,"Rada Vratislav","nezadán","bez","S",1964]
[1966,"Radová Mária","nezadán","bez","Se",1965]
[1967,"Pešek Jan","nezadán","bez","S",1956]
[1968,"Čech Lukáš","MGT PLUPO Vratimov","bez","M",1981]
[1969,"Opletal Libor","KDG Šternberk","bez","M",1979]
[1970,"Pospíšil Tomáš","KDG Šternberk","bez","M",1983]
[1971,"Jorda Ondřej","nezadán","bez","M",1981]
[1972,"Kolbek Karel","nezadán","bez","M",1974]
[1973,"Vávrová Ivana","nezadán","bez","Se",1965]
[1974,"Vávra Jiří","nezadán","bez","M",1970]
[1975,"Hála Jan","SK OAZA","bez","M",1977]
[1976,"Ferdusová Petra","MGC ´90 Brno","bez","Z",1976]
[1977,"Lokajová Jana","MGC ´90 Brno","bez","Z",1976]
[1978,"Smola Marek","nezadán","bez","M",1970]
[1979,"Penka Jiří","KDG Šternberk","bez","M",1983]
[1980,"Gaupmann Milan","nezadán","bez","M",1971]
[1981,"Janeš Vladimír","nezadán","bez","S",1963]
[1982,"Kudrna Karel","nezadán","bez","S",1967]
[1983,"Kudyn Pavel","MGC Hradečtí Orli",1,"M",1977]
[1984,"Nádvorník Milan","nezadán","bez","M",1968]
[1985,"Němec Milan","nezadán","bez","S2",1950]
[1986,"Vyskočil Rudolf","nezadán","bez","S2",1944]
[1987,"Zieman Zdeněk","nezadán","bez","S",1959]
[1988,"Melichar Lukáš","nezadán","bez","M",1978]
[1989,"Kudyn Jaroslav","nezadán","bez","S2",1947]
[1990,"Čecháček Borek","nezadán","bez","M",1981]
[1991,"Fanta Michal","nezadán","bez","M",1980]
[1992,"Krchňák David","nezadán","bez","M",1981]
[1993,"Sochor Petr","nezadán","bez","M",1981]
[1994,"Štébl Ondřej","nezadán","bez","M",1980]
[1995,"Šindelář Ondřej","Dian Viktorie Praha 8","bez","M",1984]
[1996,"Dítětová Oldřiška","TJ MG Cheb","bez","Se",1950]
[1997,"Bahník Pavel","nezadán","bez","M",1970]
[1998,"Běhounková Marcela","nezadán","bez","Se",1954]
[1999,"Brůžička Jan","nezadán","bez","M",1981]
[2000,"Dolníček Drahoslav","nezadán","bez","S2",1932]
[2001,"Frgala Tomáš","nezadán","bez","S",1965]
[2002,"Frgalová Ivana","nezadán","bez","Z",1968]
[2003,"Horák Jiří","nezadán","bez","M",1981]
[2004,"Jansa Jan","nezadán","bez","M",1970]
[2005,"Kovařík Michal","nezadán","bez","M",1971]
[2006,"Kramnář František","nezadán","bez","M",1969]
[2007,"Krejčiřík Tomáš","nezadán","bez","S",1959]
[2008,"Křivánek Petr","nezadán","bez","M",1970]
[2009,"Křivánek Jiří","nezadán","bez","M",1973]
[2010,"Kubica Miroslav","nezadán","bez","S2",1950]
[2011,"Lacina Lubor","nezadán","bez","S2",1947]
[2012,"Mach Zdeněk","nezadán","bez","S2",1943]
[2013,"Nečasová Jiřina","nezadán","bez","Se",1966]
[2014,"Nechvátal Antonín","nezadán","bez","M",1974]
[2015,"Nejedlý Zdeněk","nezadán","bez","M",1970]
[2016,"Novotný Miroslav","nezadán","bez","M",1970]
[2017,"Okurek Miloš","nezadán","bez","S",1967]
[2018,"Ondroušek Jiří","nezadán","bez","S",1955]
[2019,"Osikovský František","nezadán","bez","S",1957]
[2020,"Piňos Radek","MGC ´90 Brno","bez","S",1967]
[2021,"Přikryl Zdeněk","nezadán","bez","S2",1951]
[2022,"Sedlák Petr","nezadán","bez","S2",1942]
[2023,"Sklenák Roman","nezadán","bez","M",1972]
[2024,"Skorus Vítězslav","nezadán","bez","S2",1945]
[2025,"Skorusová Hana","nezadán","bez","Se",1950]
[2026,"Skoták Přemysl","nezadán","bez","M",1982]
[2027,"Vančura Slavomír","nezadán","bez","M",1971]
[2028,"Vavroušková Dagmar","nezadán","bez","Se",1967]
[2029,"Vejmolová Martina","nezadán","bez","Se",1966]
[2030,"Hula Miroslav","nezadán","bez","M",1980]
[2031,"Kořínek Radek","nezadán","bez","M",1980]
[2032,"Macek Pavol","ANH Praha","bez","S",1963]
[2033,"Tesařík Adam","nezadán","bez","M",1981]
[2034,"Doležel Jan","MGC Holešov","bez","M",1988]
[2035,"Dobeš Václav","nezadán","bez","M",1982]
[2036,"Dušek Michal","nezadán","bez","M",1981]
[2037,"Mácha Lukáš","ANH Praha","bez","M",1981]
[2038,"Šlapák Michal","GC 85 Rakovník",2,"M",1980]
[2039,"Koupilová Alena","KDG Šternberk","bez","Z",1979]
[2040,"Jakl Michal","nezadán","bez","M",1981]
[2041,"Chmelař Vladan","KDG Šternberk","bez","M",1982]
[2042,"Morávek Martin","nezadán","bez","M",1982]
[2043,"Háša Radek","nezadán","bez","M",1983]
[2044,"Jelinek Misha","nezadán","bez","M",1983]
[2045,"Nepraš Jiří","MGC Dragon Pelhřimov","bez","M",1983]
[2046,"Šmíd Jaromír","nezadán","bez","M",1969]
[2047,"Turek Tomáš","1. MGC Děkanka Praha","bez","M",1969]
[2048,"Laštovička Zdeněk","SK OAZA","bez","M",1970]
[2049,"Dlouhý Martin","nezadán","bez","M",1983]
[2050,"Gregor Miloš","GC 85 Rakovník","bez","M",1981]
[2051,"Guriuc Lukáš","nezadán","bez","M",1980]
[2052,"Ryšavý Miroslav","nezadán","bez","M",1974]
[2053,"Koubský Petr","TJ UNEX Uničov","bez","S",1963]
[2054,"Koubská Gabriela","DDM Praha 7","bez","Z",1986]
[2055,"Jelínek Lukáš","MGC Dragon Pelhřimov","bez","M",1981]
[2056,"Arabasz Arnošt","MGC Opava","bez","S",1965]
[2057,"Šerfösö Rostislav","MGC Opava","bez","S",1967]
[2058,"Tůma Jindřich","SK DG Chomutov","bez","M",1985]
[2059,"Solich Pavel","MGC Opava","bez","M",1968]
[2060,"Kramolišová Gabriela","MGC Opava","bez","Z",1972]
[2061,"Tvarůžek Tomáš","1. MGC Děkanka Praha","bez","M",1972]
[2062,"Sklenářová Alena","nezadán","bez","Se",1961]
[2063,"Hábich Milan","nezadán","bez","M",1980]
[2064,"Plešák Michal","nezadán","bez","M",1979]
[2065,"Štancl Daniel","nezadán","bez","M",1980]
[2066,"Kolařík Michal ","nezadán","bez","S",1965]
[2067,"Šnédar Petr","nezadán","bez","S",1967]
[2068,"Pospíšil Tomáš","Taurus Prostějov","bez","M",1981]
[2069,"Myška David","Taurus Prostějov","bez","M",1980]
[2070,"Ditrych Aleš","Taurus Prostějov","bez","M",1983]
[2071,"Povolný Petr","Taurus Prostějov","bez","M",1982]
[2072,"Wiedemann Richard","nezadán","bez","M",1977]
[2073,"Sluka Lukáš","Taurus Prostějov","bez","M",1982]
[2074,"Růžek Borek","nezadán","bez","M",1981]
[2075,"Myška Marek","Taurus Prostějov","bez","M",1982]
[2076,"Ječný Martin","SK TEMPO Praha","M","M",1987]
[2077,"Slováček Felix","nezadán","bez","M",1983]
[2078,"Oktábec Oto ml.","MGK Spartak Příbram","bez","M",1984]
[2079,"Šulc Jan","SK OAZA","bez","M",1984]
[2080,"Křivánek Lukáš","nezadán","bez","M",1982]
[2081,"Lhoták Petr","nezadán","bez","S",1965]
[2082,"Eichelmann Pavel","MG SEBA Tanvald","bez","M",1974]
[2083,"Perknovský Karel","Taurus Prostějov","bez","M",1979]
[2084,"Štolc Martin","nezadán","bez","M",1983]
[2085,"Śeliga Filip","nezadán","bez","M",1989]
[2086,"Trnkal Milan st.","KDG Tovačov",2,"S",1964]
[2087,"Vlach Jan","nezadán","bez","M",1987]
[2088,"Vlachová Jitka","nezadán","bez","Se",1967]
[2089,"Šašek Pavel","nezadán","bez","M",1978]
[2090,"Nečas Jiří","MGC Jedovnice","bez","M",1976]
[2091,"Kyzlink Petr","ME Blansko","bez","S",1964]
[2092,"Nepraš Jiří st.","MGC Dragon Pelhřimov","bez","S2",1953]
[2093,"Šacl František","nezadán","bez","M",1981]
[2094,"Koukal Vlastimil","nezadán","bez","S",1961]
[2095,"Koukalová Lenka","nezadán","bez","Se",1966]
[2096,"Krausam Jiří","TJ MG Cheb","bez","M",1978]
[2097,"Pabouček Jiří","TJ MG Cheb","bez","M",1979]
[2098,"Špinetti Dušan","TJ MG Cheb","bez","S2",1946]
[2099,"Štolba Karel","TJ MG Cheb","bez","M",1979]
[2100,"Zapletal Jan","DDM Praha 7","bez","M",1986]
[2101,"Zapletalová Věra","nezadán","bez","Se",1951]
[2102,"Žikovský Josef","nezadán","bez","M",1981]
[2103,"Arabaszová Lenka","MGC Opava","bez","Z",1973]
[2104,"Arabaszeová Martina","MGC Opava","bez","Z",1971]
[2105,"Klinger Vítězslav","MG SEBA Tanvald","bez","S",1967]
[2106,"Rendl Aleš","SKDG Fortuna Radotín",2,"M",1977]
[2107,"Ječná Ivana","SK TEMPO Praha",3,"Z",1978]
[2108,"Molnár Karel ml.","SK TEMPO Praha","M","M",1987]
[2109,"Černý Karel","nezadán","bez","M",1979]
[2110,"Sušienka Jiří","nezadán","bez","M",1978]
[2111,"Škopíková Stanislava","nezadán","bez","Z",1976]
[2112,"Dvořáčková Renata","MGC ´90 Brno","bez","Z",1974]
[2113,"Hlaváčková Diana","MGK Spartak Příbram","bez","Z",1984]
[2114,"Trnkal Tomáš","MGC Jedovnice",3,"M",1987]
[2115,"Trnkalová Marie","KDG Tovačov","bez","Se",1965]
[2116,"Vlček Vlastimil","KDG Tovačov","bez","M",1975]
[2117,"Christou David","GC 85 Rakovník",2,"M",1980]
[2118,"Oktábec Jaroslav","nezadán","bez","S",1961]
[2119,"Oktábec Oto st.","MGK Spartak Příbram","bez","S",1959]
[2120,"Oktábcová Jana","MGK Spartak Příbram","bez","Se",1964]
[2121,"Civochová Miriam","nezadán","bez","Z",1977]
[2122,"Adam Michal","nezadán","bez","M",1985]
[2123,"Blatný František","nezadán","bez","S",1960]
[2124,"Růžek Jan","nezadán","bez","M",1983]
[2125,"Hubálovský Tomáš","nezadán","bez","M",1980]
[2126,"Dedera Tomáš","nezadán","bez","M",1975]
[2127,"Hermann Daniel","nezadán","bez","M",1981]
[2128,"Nápravník Marek","nezadán","bez","M",1976]
[2129,"Pilský David","nezadán","bez","M",1979]
[2130,"Farbak Josef","SK DG Chomutov","bez","M",1970]
[2131,"Mrtvý Ladislav","KDG Tovačov","bez","S",1962]
[2132,"Vlčková Olga","KDG Tovačov","bez","Z",1977]
[2133,"Zapletalová Veronika","nezadán","bez","Z",1987]
[2134,"Gruntorád Jakub","SK TEMPO Praha","bez","M",1985]
[2135,"Konopas Jan","nezadán","bez","M",1982]
[2136,"Vymazal Adam","MGC Hradečtí Orli","bez","M",1984]
[2137,"Kožaný Lukáš","MGC Opava","bez","M",1985]
[2138,"David Martin","nezadán","bez","M",1979]
[2139,"Lašťovička Petr","nezadán","bez","M",1980]
[2140,"Maška Jaroslav","nezadán","bez","S",1967]
[2141,"Paclík Jan","nezadán","bez","M",1979]
[2142,"Daněk Miroslav","nezadán","bez","S",1960]
[2143,"Procházková Jitka","nezadán","bez","Z",1977]
[2144,"Vykydal Zbyněk","nezadán","bez","M",1976]
[2145,"Ahne Michal","nezadán","bez","M",1981]
[2146,"Havel Martin","nezadán","bez","S",1966]
[2147,"Santler Pavel","MGC Hradečtí Orli","bez","M",1981]
[2148,"Sedláček Michal","SK TEMPO Praha",2,"M",1979]
[2149,"Henn Ivan st.","nezadán","bez","S2",1954]
[2150,"Pokorný Ivan","nezadán","bez","M",1989]
[2151,"Paprskář Petr","nezadán","bez","M",1975]
[2152,"Vykydalová Kateřina","nezadán","bez","Z",1977]
[2153,"Gába Roman","TJ Bystřice p. H.","bez","M",1984]
[2154,"Mastil Richard","1. DGC Bystřice p. H.","bez","M",1985]
[2155,"Matějka Zdeněk","1. DGC Bystřice p. H.","bez","M",1987]
[2156,"Půček Karel","TJ Bystřice p. H.","bez","M",1985]
[2157,"Strnadová Vendula","1. DGC Bystřice p. H.","bez","Z",1986]
[2158,"Pekárek Jaromír","nezadán","bez","M",1972]
[2159,"Adamík Tomáš","TJ Bystřice p. H.","bez","M",1985]
[2160,"Pavelka Jiří","nezadán","bez","M",1985]
[2161,"Šálek David","nezadán","bez","M",1982]
[2162,"Hasal Martin","1. DGC Bystřice p. H.","bez","M",1986]
[2163,"Pařízek Jakub","nezadán","bez","M",1984]
[2164,"Míka Jiří","MGC Plzeň",2,"M",1977]
[2165,"Vitner Jan","GC 85 Rakovník","bez","M",1981]
[2166,"Klapka Radim","Taurus Prostějov","bez","M",1982]
[2167,"Perknovský Radim","Taurus Prostějov","bez","M",1982]
[2168,"Řepka Jindřich","MGC ´90 Brno","bez","M",1976]
[2169,"Suchánek Jan","DDM Praha 7","bez","M",1986]
[2170,"Plesník Miroslav","nezadán","bez","M",1982]
[2171,"Neprašová Jana","nezadán","bez","Z",1985]
[2172,"Kellner Václav","nezadán","bez","M",1984]
[2173,"Omar Ivan","nezadán","bez","M",1985]
[2174,"Kůrka Petr","KDG Tovačov","bez","M",1974]
[2175,"Šíblová Šárka","KDG Tovačov",4,"Z",1985]
[2176,"Macháček Zdeněk","1. DGC Bystřice p. H.",2,"M",1983]
[2177,"Velický Petr","KDG Tovačov","bez","M",1975]
[2178,"Fremml Jaroslav","Taurus Prostějov","bez","M",1985]
[2179,"Horáková Zdeňka","nezadán","bez","Se",1965]
[2180,"Maceková Jana","nezadán","bez","Se",1966]
[2181,"Maceková Kateřina","nezadán","bez","Z",1987]
[2182,"Neumann Lukáš","nezadán","bez","M",1981]
[2183,"Pakan Robert","nezadán","bez","M",1987]
[2184,"Habrda Petr","nezadán","bez","M",1982]
[2185,"Kocůrek Josef","nezadán","bez","M",1981]
[2186,"Koutný Marek","nezadán","bez","M",1982]
[2187,"Skřejpek Petr","nezadán","bez","M",1981]
[2188,"Dojčinovič Marek","KDG Šternberk","bez","M",1984]
[2189,"Švehla Michal","MGC ´90 Brno",5,"M",1985]
[2190,"Střídecký Jakub","Taurus Prostějov","bez","M",1984]
[2191,"Vlček Adam","Taurus Prostějov","bez","M",1983]
[2192,"Hoda Pavel","nezadán","bez","M",1979]
[2193,"Jíra Rostislav","nezadán","bez","M",1982]
[2194,"Novák Petr","KDG Šternberk","bez","M",1983]
[2195,"Drulák Ladislav","nezadán","bez","M",1976]
[2196,"Procházka Tomáš","Taurus Prostějov","bez","M",1983]
[2197,"Malý Petr","nezadán","bez","M",1979]
[2198,"Ondák Lukáš","nezadán","bez","M",1988]
[2199,"Ondák Štefan","nezadán","bez","S",1964]
[2200,"Lhotáková Anna","nezadán","bez","Z",1972]
[2201,"Tománek Petr","KDG Tovačov","bez","M",1978]
[2202,"Horčička Jaroslav","nezadán","bez","S2",1949]
[2203,"Novotný Jan","nezadán","bez","M",1979]
[2204,"Kouřilová Petra","1. DGC Bystřice p. H.","M","Z",1984]
[2205,"Regerová Lenka","1. DGC Bystřice p. H.","bez","Z",1987]
[2206,"Vrátný Jaroslav","MGC ´90 Brno","bez","M",1983]
[2207,"Šamánek Jan","MGC ´90 Brno","bez","M",1985]
[2208,"Říha Petr","nezadán","bez","M",1983]
[2209,"Peterka Ladislav","MGC ´90 Brno","bez","M",1982]
[2210,"Novotný Jan","MGC ´90 Brno","bez","M",1982]
[2211,"Přikryl Josef","Taurus Prostějov","bez","M",1986]
[2212,"Červeňák Jaroslav","nezadán","bez","M",1980]
[2213,"Horáková Pavlína","DDM Praha 7","bez","Z",1991]
[2214,"Hruška Miroslav","nezadán","bez","M",1981]
[2215,"Jabůrek Libor","nezadán","bez","M",1980]
[2216,"Kuriálová Kamila","nezadán","bez","Z",1978]
[2217,"Macek Martin","nezadán","bez","M",1990]
[2218,"Remeš Jaroslav","nezadán","bez","M",1981]
[2219,"Severa David","nezadán","bez","M",1981]
[2220,"Slezák Petr","nezadán","bez","M",1981]
[2221,"Trefílek Michal","nezadán","bez","M",1980]
[2222,"Tománková Jana","KDG Tovačov","bez","Z",1980]
[2223,"Miloš Rostislav","KDG Tovačov","bez","M",1970]
[2224,"Druláková Denisa","nezadán","bez","Z",1977]
[2225,"Šmerdová Jana","nezadán","bez","Z",1974]
[2226,"Vavřík Libor st.","nezadán","bez","S",1965]
[2227,"Vavřík Libor ml.","nezadán","bez","M",1984]
[2228,"Gangur Mikuláš ml.","TJ MG Cheb","bez","S",1965]
[2229,"Kábelová Božena","nezadán","bez","Se",1935]
[2230,"Koukalová Hana","nezadán","bez","Z",1974]
[2231,"Marinkov Ivan","nezadán","bez","M",1973]
[2232,"Gangurová Alice","TJ MG Cheb","bez","Z",1968]
[2233,"Otruba Pavel","Taurus Prostějov","bez","M",1984]
[2234,"Přecechtěl Petr","Taurus Prostějov","bez","M",1983]
[2235,"Straka Michal","Taurus Prostějov","bez","M",1984]
[2236,"Lehocký Jiří","nezadán","bez","M",1969]
[2237,"Lehocký Lukáš","DDM Praha 7","bez","J",1994]
[2238,"Lehocká Anna ml.","nezadán","bez","Z",1972]
[2239,"Nedvěd Ladislav","nezadán","bez","M",1985]
[2240,"Pokorný Karel st.","nezadán","bez","S2",1947]
[2241,"Pokorný Karel ml.","nezadán","bez","M",1971]
[2242,"Pokorná Jitka","nezadán","bez","S",1967]
[2243,"Soukupová Jaroslava","SKDG Jesenice","bez","Se",1948]
[2244,"Honza Martin","nezadán","bez","M",1981]
[2245,"Holubová Zuzana","nezadán","bez","Z",1981]
[2246,"Mach Aleš","MGC Hradečtí Orli","bez","M",1981]
[2247,"Mavleová Jana","nezadán","bez","Z",1977]
[2248,"Turečková Martina","nezadán","bez","Z",1968]
[2249,null,null,"bez"]
[2250,"Fojt Ivan","MG SEBA Tanvald","bez","S",1961]
[2251,"Kašparová Naďa","MG SEBA Tanvald","bez","Se",1951]
[2252,"Nepimachová Dana","MG SEBA Tanvald","bez","Se",1945]
[2253,"Péčová Libuše","MG SEBA Tanvald","bez","Se",1951]
[2254,"Petrů Jakub","MG SEBA Tanvald","bez","M",1983]
[2255,"Prousková Jitka","MG SEBA Tanvald","bez","Z",1974]
[2256,"Ticháčková Helena","MG SEBA Tanvald","bez","Se",1957]
[2257,"Bernardová Anna","nezadán","bez","Z",1985]
[2258,"Bohuňovský Vít","nezadán","bez","M",1982]
[2259,"Brabcová Marcela","nezadán","bez","Z",1984]
[2260,"Bubla Zdeněk","nezadán","bez","M",1984]
[2261,"Burger Jan","nezadán","bez","M",1985]
[2262,"Franc Zdeněk","DDM Praha 7","bez","M",1986]
[2263,"Henn Ivan ml.","nezadán","bez","M",1987]
[2264,"Henn Lars","nezadán","bez","M",1990]
[2265,"Hennová Iva","nezadán","bez","Se",1961]
[2266,"Hron František","nezadán","bez","M",1984]
[2267,"Hudec Tomáš","nezadán","bez","M",1981]
[2268,"Ištvánfy Erik","nezadán","bez","M",1982]
[2269,"Janouch Pavel","nezadán","bez","M",1985]
[2270,"Karela Kamil","nezadán","bez","M",1985]
[2271,"Kolínová Jana","nezadán","bez","Z",1982]
[2272,"Kolínová Jitka","nezadán","bez","Z",1980]
[2273,"Kolínová Marie","nezadán","bez","Se",1947]
[2274,"Koller Bohumil","nezadán","bez","M",1984]
[2275,"Kuchař Jiří","nezadán","bez","M",1984]
[2276,"Masák Josef","nezadán","bez","M",1987]
[2277,"Němeček Václav","nezadán","bez","M",1980]
[2278,"Niklová Tereza","nezadán","bez","Z",1981]
[2279,"Novák Jan","nezadán","bez","M",1984]
[2280,"Osička Karel","nezadán","bez","M",1984]
[2281,"Pancová Anna","nezadán","bez","Se",1946]
[2282,"Pilous Petr","nezadán","bez","M",1985]
[2283,"Píšová Monika","nezadán","bez","Z",1984]
[2284,"Plicka Tomáš","nezadán","bez","M",1984]
[2285,"Podlesná Marie","nezadán","bez","Z",1984]
[2286,"Pommer Karel","nezadán","bez","M",1985]
[2287,"Roháčková Michaela","nezadán","bez","Z",1980]
[2288,"Soukup Kamil","nezadán","bez","M",1982]
[2289,"Teč Ota","nezadán","bez","M",1985]
[2290,"Trinkmoc Martin","nezadán","bez","M",1981]
[2291,"Turč Jiří","nezadán","bez","M",1981]
[2292,"Vondrušková Ivana","nezadán","bez","Se",1965]
[2293,"Bartůněk Jiří","nezadán","bez","S",1964]
[2294,"Kvíz Petr","nezadán","bez","M",1982]
[2295,"Růžička Tomáš","nezadán","bez","M",1981]
[2296,"Šeligová Lenka","DDM Praha 7","bez","Z",1991]
[2297,"Boháčková Jaromíra","nezadán","bez","Z",1981]
[2298,"Vondráková Markéta","SK OAZA","bez","Z",1980]
[2299,"Komadová Kateřina","nezadán","bez","Z",1980]
[2300,"Krčálová Alena","nezadán","bez","Z",1979]
[2301,"Turek Martin","nezadán","bez","M",1972]
[2302,"Smílek Ondřej","TJ Bystřice p. H.","bez","M",1987]
[2303,"Binder Karel","nezadán","bez","M",1977]
[2304,"Chromčák Antonín","nezadán","bez","M",1990]
[2305,"Chromčáková Lucie","TJ UNEX Uničov","bez","Z",1983]
[2306,"Kadlec Lukáš","TJ UNEX Uničov","bez","M",1993]
[2307,"Kadlecová Jitka","nezadán","bez","Se",1957]
[2308,"Kunčer Michal","nezadán","bez","M",1987]
[2309,"Římská Lenka","nezadán","bez","Z",1989]
[2310,"Římský Stanislav ml.","DDM Praha 7","bez","M",1986]
[2311,"Nesvadba Martin","ME Blansko","bez","M",1977]
[2312,"Palacký Michal","Taurus Prostějov","bez","M",1987]
[2313,"Průcha Ivan","nezadán","bez","M",1985]
[2314,"Chleborad Jiří","MGC ´90 Brno","bez","M",1985]
[2315,"Gerža Ondřej","KDG Šternberk","bez","M",1984]
[2316,"Klapka Petr","KDG Šternberk","bez","M",1984]
[2317,"Vítková Michaela","nezadán","bez","Z",1968]
[2318,"Pajkov Mitko","SK DG Chomutov",3,"M",1968]
[2319,"Hořejšek Rudolf","GC 85 Rakovník","bez","M",1975]
[2320,"Prokopová Olivia","MGC Holešov",3,"Ju",1995]
[2321,"Ošinský Petr","KDG Šternberk","bez","M",1987]
[2322,"Hnila Marian","KDG Šternberk","bez","M",1983]
[2323,"Hájíčková Dagmar","nezadán","bez","Z",1981]
[2324,"Maschke Jan","nezadán","bez","M",1987]
[2325,"Eichler Ladislav","KDG Tovačov","bez","S",1967]
[2326,"Eichlerová Lenka","KDG Tovačov","bez","Z",1974]
[2327,"Havelka Martin","KDG Tovačov",2,"M",1977]
[2328,"Trnkal Milan ml.","KDG Tovačov","bez","M",1991]
[2329,"Vlček František","KDG Tovačov","bez","S2",1948]
[2330,"Vlčková Vlasta","KDG Tovačov","bez","Se",1951]
[2331,"Vodička Vojtěch","KDG Tovačov","bez","M",1988]
[2332,"Žaloudková Radka","MGC ´90 Brno",2,"Z",1979]
[2333,"Bartlová Dagmar","nezadán","bez","Z",1977]
[2334,"Wagner Jan","DDM Praha 7","bez","M",1993]
[2335,"Wagnerová Lenka","nezadán","bez","Se",1964]
[2336,"Wagnerová Petra","nezadán","bez","Z",1982]
[2337,"Šimek Petr","MGC Olomouc","bez","M",1975]
[2338,"Šimek Jan","MGC Olomouc","bez","M",1977]
[2339,"Kollár Petr","nezadán","bez","M",1984]
[2340,"Veselský Ladislav","Golf club Hulín","bez","M",1984]
[2341,"Tietzová Kateřina","MGC ´90 Brno","M","Z",1983]
[2342,"Suchá Lucie","nezadán","bez","Z",1983]
[2343,"Králová Pavlína","MGC Jedovnice","bez","Z",1972]
[2344,"Grepl Rudolf","MGC ´90 Brno","bez","M",1975]
[2345,"Celý Jan","nezadán","bez","M",1987]
[2346,"Michalík Luděk","nezadán","bez","M",1985]
[2347,"Kuchařík Michal","Golf club Hulín","bez","M",1980]
[2348,"Ondrejec Petr","DDM Praha 7","bez","M",1986]
[2349,"Rýdl Adam","nezadán","bez","M",1985]
[2350,"Zapletal Tomáš","Golf club Hulín","bez","M",1984]
[2351,"Jelínek Milan","nezadán","bez","M",1968]
[2352,"Duda Ladislav","KDG Tovačov","bez","M",1987]
[2353,"Hálka Petr","KDG Tovačov","bez","M",1983]
[2354,"Kolář Martin","KDG Tovačov","bez","M",1989]
[2355,"Nakládal Petr","KDG Tovačov","bez","M",1974]
[2356,"Netopil Pavel","KDG Tovačov",2,"M",1968]
[2357,"Novák Jiří","KDG Tovačov","bez","M",1976]
[2358,"Řiháček Tomáš","KDG Tovačov","bez","M",1989]
[2359,"Šmíd Zdeněk","KDG Tovačov","bez","M",1980]
[2360,"Chládek Oto","nezadán","bez","M",1975]
[2361,"Šmíd Václav","KDG Tovačov","bez","M",1976]
[2362,"Hradečný Tomáš","KDG Tovačov","bez","M",1987]
[2363,"Souček Filip","DDM Praha 7","bez","M",1992]
[2364,"Sanvenero Daniel","nezadán","bez","M",1977]
[2365,"Kováčová Lenka","nezadán","bez","Z",1977]
[2366,"Janáček Milan","MGC Olomouc","bez","M",1984]
[2367,"Hufnágel Martin","MGC Opava","bez","M",1969]
[2368,"Šebela Vojtěch","MGC Jedovnice","bez","M",1985]
[2369,"Šebela Radek","MGC Jedovnice",2,"M",1980]
[2370,"Šálková Renata","nezadán","bez","Z",1984]
[2371,"Králík Jakub","MGC Olomouc","bez","M",1984]
[2372,"Kubica Pavel","SK DG Chomutov","bez","M",1975]
[2373,"Melzoch Marek","nezadán","bez","M",1989]
[2374,"Procházka Emil","MGC Jedovnice",3,"S2",1947]
[2375,"Macková Vítězslava","nezadán","bez","Z",1976]
[2376,"Ondrejcová Lenka","nezadán","bez","Z",1990]
[2377,"Bouchal Jan","KDG Tovačov","bez","M",1989]
[2378,"Kalvoda Antonín st.","KDG Tovačov","bez","S",1961]
[2379,"Kalvoda Antonín ml.","KDG Tovačov","bez","M",1986]
[2380,"Kalvodová Ludmila st.","KDG Tovačov","bez","Se",1963]
[2381,"Kalvodová Ludmila ml.","KDG Tovačov","bez","Z",1985]
[2382,"Musilová Andrea","KDG Tovačov","bez","Z",1976]
[2383,"Navrátil Pavel","KDG Tovačov","bez","M",1990]
[2384,"Nečekal Roman","KDG Tovačov","bez","M",1986]
[2385,"Ondrušák Jiří","KDG Tovačov","bez","S",1963]
[2386,"Ondrušák Karel","KDG Tovačov","bez","S",1959]
[2387,"Řiháček Jan","KDG Tovačov","bez","M",1990]
[2388,"Trnkalová Anna","KDG Tovačov",3,"Z",1993]
[2389,"Utěkal Lukáš","KDG Tovačov","bez","M",1987]
[2390,"Vymazal Milan","KDG Tovačov",1,"S",1960]
[2391,"Zlámal Jan","KDG Tovačov","bez","S",1955]
[2392,"Macháčková Jarmila","KDG Tovačov","bez","Se",1960]
[2393,"Machálek Marek","KDG Tovačov","bez","M",1979]
[2394,"Machálek Ondřej","KDG Tovačov","bez","M",1981]
[2395,"Cimerman Jaroslav","SKDG Jesenice",4,"S2",1949]
[2396,"Cimerman Jan","SKDG Jesenice",4,"M",1984]
[2397,"Fousek Vladimír","DGK Louny","bez","S",1964]
[2398,"Lachký Robert","nezadán","bez","M",1973]
[2399,"Richter Jan","DGK Louny","bez","M",1979]
[2400,"Richter Aleš","nezadán","bez","M",1983]
[2401,"Sachr Tomáš","nezadán","bez","M",1983]
[2402,"Neubert Aleš","DGK Louny","bez","M",1984]
[2403,"Mansfeld Martin","TJ MG Cheb",4,"M",1984]
[2404,"Prokop Jan st.","SK TEMPO Praha","bez","S",1965]
[2405,"Švácha Josef","GC 85 Rakovník","bez","S",1956]
[2406,"Dzurindák Martin","TJ MG Cheb","bez","M",1975]
[2407,"Gangur Mikuláš st.","TJ MG Cheb","bez","S2",1939]
[2408,"Gangurová Jana","TJ MG Cheb","bez","Se",1942]
[2409,"Gangur Jonatan","TJ MG Cheb","bez","Jz",1998]
[2410,"Halamková Jana","TJ MG Cheb","bez","Z",1970]
[2411,"Halamková Sára","TJ MG Cheb","bez","Ju",1994]
[2412,"Plassová Miluše","TJ MG Cheb","bez","Se",1952]
[2413,"Veselý Tomáš","nezadán","bez","S",1965]
[2414,"Veselá Hana","nezadán","bez","Se",1966]
[2415,"Veselý Jakub","nezadán","bez","M",1993]
[2416,"Vejražka Vít","TJ MG Cheb","bez","J",1995]
[2417,"Vejražková Ivana","TJ MG Cheb","bez","Se",1967]
[2418,"Petr Michal","nezadán","bez","M",1977]
[2419,"Pešek Jaroslav ml.","nezadán","bez","M",1990]
[2420,"Pešková Veronika","nezadán","bez","Z",1984]
[2421,"Pešková Jurina","nezadán","bez","Se",1962]
[2422,"Spěvák Tomáš","nezadán","bez","M",1970]
[2423,"Tichý Tomáš","nezadán","bez","M",1985]
[2424,"Rendl Jiří","nezadán","bez","S",1967]
[2425,"Sokola Ondřej","nezadán","bez","M",1985]
[2426,"Daňková Markéta","nezadán","bez","Z",1987]
[2427,"Daňková Světlana","nezadán","bez","Se",1963]
[2428,"Granilla Tomáš","nezadán","bez","M",1984]
[2429,"Pleva Jiří","Taurus Prostějov","bez","M",1983]
[2430,"Daňa Miroslav","nezadán","bez","S",1963]
[2431,"Dočkal Zdeněk","nezadán","bez","S",1963]
[2432,"Dufka Martin","Taurus Prostějov","bez","M",1987]
[2433,"Mlčoch Martin","1. DGC Bystřice p. H.",1,"M",1986]
[2434,"Mlčoch Ondřej","1. DGC Bystřice p. H.",1,"M",1989]
[2435,"Králík Milan","MGC Olomouc","bez","S2",1938]
[2436,"Burda Pavel","nezadán","bez","M",1983]
[2437,"Panuška Petr","nezadán","bez","M",1978]
[2438,"Maršíková Darina","MGC Jedovnice","bez","Z",1980]
[2439,"Minář Vladislav","MGC Jedovnice","bez","M",1978]
[2440,"Meštrovičová Jana","nezadán","bez","Z",1970]
[2441,"Skřivánek Marcel","KDG  VŠB-TU Ostrava","bez","M",1977]
[2442,"Rozehnalová Hana","KDG  VŠB-TU Ostrava","bez","Z",1978]
[2443,"Vlčková Kateřina","KDG  VŠB-TU Ostrava","bez","Z",1980]
[2444,"Lomický Ladislav","nezadán","bez","S",1965]
[2445,"Veselý Jaroslav","nezadán","bez","S",1965]
[2446,"Veselý Martin","nezadán","bez","M",1972]
[2447,"Blumová Eva","nezadán","bez","Z",1982]
[2448,"Majerová Michaela","KDG Tovačov","bez","Z",1983]
[2449,"Říhová Martina","KDG Tovačov","bez","Z",1978]
[2450,"Roman Pavel","KDG Tovačov","bez","M",1987]
[2451,"Štulpa Ladislav","KDG Tovačov","bez","M",1988]
[2452,"Zapletálek Jan","KDG Tovačov","bez","M",1985]
[2453,"Koblihová Michaela","1. DGC Bystřice p. H.","bez","Z",1988]
[2454,"Švehlíková Silvie","1. DGC Bystřice p. H.",2,"Z",1989]
[2455,"Damjanovová Kateřina","nezadán","bez","Z",1976]
[2456,"Kolář Martin","nezadán","bez","M",1972]
[2457,"Štyks Jaromír","TJ Start Brno",4,"M",1974]
[2458,"Vodrážka Martin","nezadán","bez","M",1978]
[2459,"Jonáš Miroslav","KDG  VŠB-TU Ostrava","bez","M",1980]
[2460,"Řezáčová Jana","MGK Spartak Příbram","bez","Z",1973]
[2461,"Řezáč Michal","MGK Spartak Příbram","bez","M",1976]
[2462,"Kubíková Jarmila","SK DG Chomutov","bez","Se",1955]
[2463,"Kupilík Ivan","nezadán","bez","S2",1950]
[2464,"Maršálek Martin","nezadán","bez","S",1967]
[2465,"Blaťák Jan","KDG Tovačov","bez","M",1988]
[2466,"Blaťáková Martina","KDG Tovačov","bez","Z",1990]
[2467,"Dudová Barbora","KDG Tovačov","bez","Z",1983]
[2468,"Janeček Robin","KDG Tovačov","bez","M",1985]
[2469,"Havlovičová Kristina","nezadán","bez","Z",1988]
[2470,"Kocev Lukáš","nezadán","bez","M",1985]
[2471,"Koukalová Pavla","nezadán","bez","Z",1989]
[2472,"Soustružník Karel","TJ MG Cheb",2,"S2",1936]
[2473,"Špinettiová Lidmila","TJ MG Cheb","bez","Se",1953]
[2474,"Kreps Jiří","nezadán","bez","S",1965]
[2475,"Kubicová Libuše","nezadán","bez","Se",1948]
[2476,"Mendlová Eva","nezadán","bez","Se",1957]
[2477,"Fousek Martin","nezadán","bez","M",1984]
[2478,"Starosta Vítězslav","nezadán","bez","M",1985]
[2479,"Maršálková Věra","nezadán","bez","Z",1981]
[2480,"Prosolová Lenka","nezadán","bez","Z",1981]
[2481,"Brož Jiří","nezadán","bez","S2",1954]
[2482,"Cimermanová Dagmar","nezadán","bez","Se",1953]
[2483,"Šámalová Miloslava","nezadán","bez","Se",1961]
[2484,"Janáček Milan","MGC Olomouc",2,"S2",1953]
[2485,"Švehla Vladimír","MGC ´90 Brno","bez","S2",1953]
[2486,"Chromčák Petr","KDG Tovačov","bez","M",1987]
[2487,"Zavadil Marek","KDG Tovačov","bez","M",1974]
[2488,"Trnka Michal","MGC Plzeň","bez","M",1975]
[2489,"Trnka Zdeněk","nezadán","bez","S",1965]
[2490,"Vácha Lukáš","nezadán","bez","M",1979]
[2491,"Würtl Karel","nezadán","bez","M",1971]
[2492,"Holub Zbyněk","nezadán","bez","M",1988]
[2493,"Martínek Michal","nezadán","bez","M",1985]
[2494,"Kubík Jan","SK DG Chomutov","bez","M",1988]
[2495,"Lipmann Karel ml.","nezadán","bez","M",1984]
[2496,"Pulák Michal","SK DG Chomutov","bez","M",1984]
[2497,"Schlichts Tomáš","DDM Praha 7","bez","M",1986]
[2498,null,null,"bez"]
[2499,"Fousek Jan","DGK Louny","bez","M",1990]
[2500,"Fousek Jiří","DGK Louny","bez","M",1990]
[2501,"Hadač Ladislav","nezadán","bez","M",1971]
[2502,"Moutvička Jaroslav","MGC Plzeň",2,"S",1960]
[2503,"Moutvička Ondřej","MGC Plzeň",2,"M",1983]
[2504,"Benešovský Ladislav","MGC Jedovnice","bez","M",1989]
[2505,"Benešovský Ladislav","MGC Jedovnice","bez","S",1963]
[2506,"Lukáš Jiří","MGC Jedovnice","bez","M",1983]
[2507,"Opletal Jiří","MGC Jedovnice","bez","M",1979]
[2508,"Šebela Josef","MGC Jedovnice","bez","S2",1954]
[2509,"Šebelová Eliška","MGC Jedovnice","bez","Se",1955]
[2510,"Filipi Jiří","nezadán","bez","M",1972]
[2511,"Horák Otakar","nezadán","bez","S",1964]
[2512,"Sedláček Petr","MGC Plzeň","bez","M",1974]
[2513,"Harman Michal","Taurus Prostějov","bez","M",1981]
[2514,"Sluka Michal","Taurus Prostějov","bez","M",1988]
[2515,"Havlovič Petr","nezadán","bez","S",1958]
[2516,"Plevný Miroslav","TJ MG Cheb","bez","S",1965]
[2517,"Antošová Kristýna","DDM Praha 7","bez","Z",1986]
[2518,"Marek Robert","nezadán","bez","M",1973]
[2519,"Ferák Karel","Minigolf club Vsetín","bez","M",1969]
[2520,"Gába Karel","DDM Praha 7","bez","S",1960]
[2521,"Řehulka Jan","Taurus Prostějov","bez","M",1985]
[2522,"Pecák Milan","nezadán","bez","S",1962]
[2523,"Pecáková Veronika","nezadán","bez","Z",1984]
[2524,"Dejnožka Petr","nezadán","bez","M",1985]
[2525,"Králík Milan","MGC Olomouc","bez","S",1960]
[2526,"Krejčí Jakub","DDM Praha 7","bez","M",1986]
[2527,"Kubica Daniel","nezadán","bez","M",1970]
[2528,"Čech Vladimír","SKDG Fortuna Radotín","bez","M",1988]
[2529,"Viková Karolina","nezadán","bez","Z",1988]
[2530,"Sabuka David","nezadán","bez","M",1975]
[2531,"Vrba Václav","nezadán","bez","S2",1947]
[2532,"Vrba Václav ml.","nezadán","bez","M",1987]
[2533,"Bednář Jakub","MGC ´90 Brno","bez","M",1982]
[2534,"Peňáz Josef","MGC ´90 Brno",3,"M",1979]
[2535,"Dočkal Jan","SMG 2000 Ústí n. L.","bez","M",1969]
[2536,"Löffelmann Roman","SMG 2000 Ústí n. L.","bez","S",1960]
[2537,"Pecháč Jaroslav","SMG 2000 Ústí n. L.","bez","S2",1949]
[2538,"Splitek Vladimír","SMG 2000 Ústí n. L.","bez","M",1975]
[2539,"Šrámek Pavel","SMG 2000 Ústí n. L.","bez","S",1965]
[2540,"Tarasov Pavel","SMG 2000 Ústí n. L.","bez","M",1987]
[2541,"Trejbal Josef","SMG 2000 Ústí n. L.","bez","S2",1949]
[2542,"Vorlíček Jaroslav","SMG 2000 Ústí n. L.","bez","M",1978]
[2543,"Kolinger Jan","nezadán","bez","S",1960]
[2544,"Sládek Radek","DDM Praha 7","bez","M",1991]
[2545,"Procházková Marie","MGC Jedovnice","bez","Se",1949]
[2546,"Hanzelková Drahomíra","nezadán","bez","Se",1958]
[2547,"Hanzelka Tomáš","DDM Praha 7","bez","M",1986]
[2548,"Hlaváčová Michaela","nezadán","bez","Z",1988]
[2549,"Večerka Lukáš","nezadán","bez","M",1984]
[2550,"Nováková Dana","DDM Praha 7","bez","Z",1986]
[2551,"Suchánková Kateřina","nezadán","bez","Z",1979]
[2552,"Palkovský Jan","KGB Kojetín","bez","J",1994]
[2553,"Kocian Petr","KDG  VŠB-TU Ostrava","bez","M",1978]
[2554,"Štěpánek Jakub","KDG  VŠB-TU Ostrava","bez","M",1977]
[2555,"Trejbalová Ivonne","SMG 2000 Ústí n. L.","bez","Z",1968]
[2556,"Prokeš Jiří","Start Kopřivnice","bez","M",1970]
[2557,"Válková Monika","MGC Opava","bez","Z",1976]
[2558,"Andráši Martin","MGC Olomouc","bez","M",1990]
[2559,"Skupil Viktor","MGK Spartak Příbram","bez","S",1964]
[2560,"Kovář Josef","SK DG Chomutov",4,"M",1970]
[2561,"Heger Michal","KDG  VŠB-TU Ostrava","bez","M",1976]
[2562,"Hudec Radoslav","1. DGC Bystřice p. H.","bez","M",1990]
[2563,"Vaic Jan","nezadán","bez","S",1962]
[2564,"Vaic Petr","DDM Praha 7","bez","M",1991]
[2565,"Čeladník Michal","1. DGC Bystřice p. H.","bez","M",1986]
[2566,"Kerlín Daniel","KDG  VŠB-TU Ostrava","bez","M",1977]
[2567,"Řehulka Jan","MGC Jedovnice",2,"S2",1951]
[2568,"Machálek Dalibor","MGC Holešov","bez","M",1988]
[2569,"Perutka Marek","TJ Bystřice p. H.","bez","M",1989]
[2570,"Brettlová Jana","SKDG Jesenice",2,"Z",1979]
[2571,"Knotková Andrea","nezadán","bez","Z",1989]
[2572,"Roková Květa","nezadán","bez","Se",1939]
[2573,"Rok Josef","SKGC Frant. Lázně","bez","S2",1932]
[2574,"Matula Jaromír","nezadán","bez","M",1970]
[2575,"Kratochvíl Tomáš","MGC Jedovnice","bez","M",1984]
[2576,"Kolář Prokop","nezadán","bez","M",1973]
[2577,"Dočkal Alois","KDG Tovačov",5,"M",1987]
[2578,"Konečná Lucie","KDG Tovačov","bez","Z",1987]
[2579,"Šálková Milena","KDG Tovačov","bez","Z",1988]
[2580,"Zemanová Barbora","KDG Tovačov","bez","Z",1986]
[2581,"Novák Michal","1. DGC Bystřice p. H.","bez","M",1988]
[2582,"Halama Jiří","nezadán","bez","M",1975]
[2583,"Komeda Miroslav","SK TEMPO Praha",3,"M",1984]
[2584,"Michálek Radim","KDG Tovačov","bez","M",1989]
[2585,"Kraus Lukáš","nezadán","bez","M",1984]
[2586,"Novák Tomáš","nezadán","bez","S",1965]
[2587,"Pergl Jan ml.","SMG 2000 Ústí n. L.","bez","Jz",2000]
[2588,"Kulhánková Kateřina","nezadán","bez","Z",1984]
[2589,"Dobrovolný Tibor","TJ MG Cheb","bez","S",1964]
[2590,"Dobrovolná Karina","TJ MG Cheb","bez","Z",1989]
[2591,"Šatra Šimon","TJ MG Cheb","bez","M",1989]
[2592,"Šatra Tadeáš","TJ MG Cheb","bez","M",1990]
[2593,"Vlček Michal","DDM Praha 7","bez","M",1986]
[2594,"Zubalíková Karolína","GC 85 Rakovník","bez","Z",1989]
[2595,"Prokopová Libuše","nezadán","bez","Z",1974]
[2596,"Rimpler Josef","MGC Jedovnice",1,"S2",1947]
[2597,"Kladiva Martin","SKDG Příbor","bez","M",1972]
[2598,"Supík Petr","SKDG Příbor","bez","S",1958]
[2599,"Veřmiřovský Michal","DDM Praha 7","bez","M",1986]
[2600,"Řeháková Silvie","nezadán","bez","Z",1981]
[2601,"Halaška David","nezadán","bez","M",1980]
[2602,"Halaška Jan","nezadán","bez","S",1957]
[2603,"Švandová Jana","MGC Polička",3,"Z",1974]
[2604,"Švanda František","MGC Polička",5,"S2",1954]
[2605,"Švanda Ondřej","MGC Polička",5,"M",1986]
[2606,"Švanda Radek","MGC Polička",5,"M",1973]
[2607,"Martinů Ladislav","MGC Polička",5,"S",1958]
[2608,"Stolzová Svatava","MGC Hradečtí Orli","bez","Se",1965]
[2609,"Zubalík Karel","nezadán","bez","S",1966]
[2610,"Kolesár Vladimír","MGC Jedovnice",4,"M",1972]
[2611,"Králík Jiří","nezadán","bez","S",1963]
[2612,"Johanis Josef","nezadán","bez","S2",1947]
[2613,"Ščerbakov Evžen","SMG 2000 Ústí n. L.","bez","M",1988]
[2614,"Tomaštík Pavel","SMG 2000 Ústí n. L.","bez","S2",1949]
[2615,"Pikal Jaroslav","nezadán","bez","S",1966]
[2616,"Vlček Jiří","SK DG Chomutov","bez","M",1986]
[2617,"Krajčová Dagmar","DDM Praha 7","bez","Se",1958]
[2618,"Balada Martin","DDM Praha 7","bez","M",1983]
[2619,"Procházka David","DDM Praha 7","bez","M",1983]
[2620,"Sirotek Jaroslav","DDM Praha 7","bez","S2",1944]
[2621,"Beranová Martina","SMG 2000 Ústí n. L.","bez","Z",1983]
[2622,"Šeršeň Jiří","nezadán","bez","S",1965]
[2623,"Hanák Jan","1. DGC Bystřice p. H.","bez","M",1990]
[2624,"Blažek Viktor","nezadán","bez","M",1989]
[2625,"Večeřa Tomáš","nezadán","bez","M",1989]
[2626,"Andrášiová Eva","nezadán","bez","Se",1964]
[2627,"Měchura Václav","MGC Olomouc","bez","S2",1953]
[2628,"Hanák Tomáš","MGC ´90 Brno","bez","M",1979]
[2629,"Stolz Radim","MGC Hradečtí Orli","bez","M",1989]
[2630,"Dostálek František","SK Mlýn Přerov","bez","S2",1949]
[2631,"Dostálková Vladimíra","SK Mlýn Přerov",3,"Se",1949]
[2632,"Tošovský Pavel","DDM Praha 7","bez","S",1962]
[2633,"Studený Aleš","TJ Bystřice p. H.","bez","M",1990]
[2634,"Vaculíková Petra","TJ Bystřice p. H.","bez","Z",1992]
[2635,"Vaněk Tomáš","MGC Polička","bez","M",1989]
[2636,"Vaško Michal","MGC Polička",5,"M",1986]
[2637,"Macho Ivan","MGC Olomouc","M","M",1988]
[2638,"Klaban Michal","TJ Start Brno","bez","M",1989]
[2639,"Klaban Tomáš","TJ Start Brno","bez","M",1992]
[2640,"Mittner Martin","TJ Start Brno","bez","M",1990]
[2641,"Kejík Pavel","MGC ´90 Brno","bez","M",1987]
[2642,"Stránský Michal","MGC ´90 Brno","bez","M",1988]
[2643,"Ludwig Jakub","MGC ´90 Brno","bez","M",1988]
[2644,"Gric Pavel","MGC ´90 Brno","bez","M",1988]
[2645,"Čábelka Petr","MGC ´90 Brno","bez","M",1987]
[2646,"Šťastný Filip","MGC ´90 Brno","bez","M",1988]
[2647,"Hasal Radek","1. DGC Bystřice p. H.","bez","M",1991]
[2648,"Růžička Dominik","TJ Bystřice p. H.","bez","M",1992]
[2649,"Poláková Petra","DDM Praha 7","bez","Z",1986]
[2650,"Straková Kamila","nezadán","bez","Z",1977]
[2651,"Jirkalová Milena","nezadán","bez","Se",1957]
[2652,"Trnka Jiří ml.","DDM Praha 7","bez","J",1996]
[2653,"Čása Daniel","DDM Praha 7","bez","J",1996]
[2654,"Čása Tomáš","SKDG Fortuna Radotín","bez","Jz",2000]
[2655,"Trnka Michal ml.","DDM Praha 7","bez","J",1997]
[2656,"Benda Lumír ml.","MGC Plzeň",2,"J",1997]
[2657,"Tuháček Jakub","DDM Praha 7","bez","J",1995]
[2658,"Sedláček Tomáš","DDM Praha 7","bez","Jz",2000]
[2659,"Kuchař Jan nejml.","DDM Praha 7","bez","Jz",2000]
[2660,"Petrák Milan","nezadán","bez","S",1967]
[2661,"Šámal Michal","DGK Louny","bez","M",1985]
[2662,"Lyčka Daniel","nezadán","bez","M",1985]
[2663,"Šauer Cyril","MGC Polička",5,"S2",1948]
[2664,"Šauer Jiří","nezadán","bez","M",1977]
[2665,"Čapčuch Josef","KDG Šternberk","bez","M",1968]
[2666,"Gažarová Pavla","nezadán","bez","Z",1987]
[2667,"Šnajdr Miroslav","DDM Praha 7","bez","M",1986]
[2668,"Večeřa Jakub","DDM Praha 7","bez","M",1986]
[2669,"Dudová Monika","KDG Tovačov","bez","Z",1989]
[2670,"Kabelová Jana","nezadán","bez","Se",1959]
[2671,"Kabele David","nezadán","bez","M",1990]
[2672,"Straško Marián","MGC Olomouc","M","M",1987]
[2673,"Prokešová Kateřina","MGC ´90 Brno","bez","Z",1989]
[2674,"Dubská Lucie","MGC ´90 Brno","bez","Z",1989]
[2675,"Maršounová Zuzana","MGC ´90 Brno","bez","Z",1989]
[2676,"Nadaský Pavel","ME Blansko",4,"M",1988]
[2677,"Porupka Jan","MGC ´90 Brno","bez","M",1988]
[2678,"Jonner Marek","MGC ´90 Brno","bez","M",1987]
[2679,"Rendl Jakub","SKGC Frant. Lázně","bez","M",1990]
[2680,"Matějíček Pavel","DDM Praha 7","bez","M",1986]
[2681,"Dvořák Patrik","SK TEMPO Praha","bez","M",1972]
[2682,"Řihošek Petr","KDG Tovačov","bez","M",1987]
[2683,"Koplas Jakub","KDG Tovačov","bez","M",1989]
[2684,"Želizňák Jan","MG SEBA Tanvald",2,"M",1978]
[2685,"Zelinka Pavel","nezadán","bez","M",1970]
[2686,"Honek Jan","KDG 2000 Ostrava","bez","M",1986]
[2687,"Vymětal Vladimír","KGB Kojetín","bez","M",1974]
[2688,"Vlach Petr","SKDG Fortuna Radotín",4,"M",1983]
[2689,"Zelenka Robert","SK OAZA","bez","M",1975]
[2690,"Král Aleš","MGC Jedovnice","bez","M",1972]
[2691,"Trojáček Zdeněk","MGC Jedovnice","bez","M",1980]
[2692,"Šebelová Erika","MGC Jedovnice",5,"Z",1984]
[2693,"Jelínek Libor","nezadán","bez","M",1974]
[2694,"Chládek Jan","MGC Plzeň","bez","M",1988]
[2695,"Varmuža Norbert","nezadán","bez","M",1975]
[2696,"Vymětal Jaromír st.","KGB Kojetín","bez","S",1955]
[2697,"Jirkovský Tomáš","GC 85 Rakovník","bez","M",1969]
[2698,"Nejezchleb Jiří","MGC Jedovnice","bez","M",1978]
[2699,"Jarolímek Jan","MGK Spartak Příbram","bez","M",1976]
[2700,"Vlček Štěpán","MGC Polička","bez","M",1988]
[2701,"Kroupa Pavel","Taurus Prostějov","bez","M",1988]
[2702,"Sládek Petr","nezadán","bez","S",1966]
[2703,"Nečekalová Marcela","TJ MG Cheb","bez","Z",1980]
[2704,"Hornek Jakub","SKGC Frant. Lázně","bez","M",1988]
[2705,"Hornek Jan","SKGC Frant. Lázně","bez","M",1991]
[2706,"Kolář Lukáš","nezadán","bez","M",1990]
[2707,"Štropová Nikola","SK TEMPO Praha","bez","Z",1990]
[2708,"Zicháčková Veronika","TJ Bystřice p. H.","bez","Z",1981]
[2709,"Prokop Jan ml.","SK TEMPO Praha","bez","Jz",1998]
[2710,"Hruda Karel","Taurus Prostějov","bez","M",1990]
[2711,"Jurnikl Radek","Taurus Prostějov","bez","M",1989]
[2712,"Papoušek Michal","ME Blansko","bez","M",1990]
[2713,"Orság Tomáš","nezadán","bez","M",1982]
[2714,"Růžička Michal","Minigolf club Vsetín","bez","M",1976]
[2715,"Martínek Richard","Minigolf club Vsetín","bez","M",1979]
[2716,"Dočkalová Iveta","nezadán","bez","Se",1966]
[2717,"Včelica Tomáš","nezadán","bez","M",1968]
[2718,"Včelica Michal","DDM Praha 7","bez","M",1986]
[2719,"Mrnuštík Radek","DDM Praha 7","bez","M",1991]
[2720,"Mrnuštíková Jana ml.","nezadán","bez","Z",1987]
[2721,"Mrnuštíková Jana st.","nezadán","bez","Se",1963]
[2722,"Mrnuštík Milan","nezadán","bez","S",1962]
[2723,"Daňa Josef","nezadán","bez","S",1966]
[2724,"Roedlová Adéla","nezadán","bez","Z",1988]
[2725,"Helšusová Bětka","nezadán","bez","Z",1987]
[2726,"Rieger Lumír","Start Kopřivnice",2,"M",1972]
[2727,"Cabal David","nezadán","bez","M",1990]
[2728,"Prajerová Sabina","SMG 2000 Ústí n. L.","bez","Se",1967]
[2729,"Havran Martin","DDM Praha 7","bez","M",1991]
[2730,"Bystřický Tomáš","GC 85 Rakovník","bez","J",1996]
[2731,"Dobrovolná Jaroslava","TJ MG Cheb","bez","Se",1962]
[2732,"Kraus Jaroslav","SKDG Jesenice","bez","S2",1944]
[2733,"Handl Petr","MGC ´90 Brno","bez","M",1993]
[2734,"Polášek Jan","MGC ´90 Brno","bez","M",1990]
[2735,"Prajer Zdeněk","SMG 2000 Ústí n. L.","bez","S",1964]
[2736,"Vepryk Alexander","SMG 2000 Ústí n. L.","bez","S",1967]
[2737,"Kroppová Alexandra","KDG  VŠB-TU Ostrava","bez","Z",1978]
[2738,"Pospíšil David","nezadán","bez","M",1975]
[2739,"Malý Jaromír","KDG Šternberk","bez","M",1975]
[2740,"Lahodná Kateřina","MGC Plzeň","bez","Z",1978]
[2741,"Vlachová Dana","nezadán","bez","Se",1962]
[2742,"Škvor Václav","SMG 2000 Ústí n. L.","bez","M",1980]
[2743,"Meštrovičová (Kordiová) Lenka","SMG 2000 Ústí n. L.","bez","Z",1970]
[2744,"Rejhon Zdeněk","SK Mlýn Přerov",3,"S2",1940]
[2745,"Rejhon Martin","SK Mlýn Přerov","bez","S",1965]
[2746,"Rejhonová Jitka","SK Mlýn Přerov","bez","Se",1965]
[2747,"Bébar Zdeněk","SK Mlýn Přerov","bez","S",1956]
[2748,"Mollinová Lenka","SK Mlýn Přerov","bez","Se",1963]
[2749,"Braičev Radek","nezadán","bez","M",1973]
[2750,"Březinová Lenka","SK DG Chomutov","bez","Z",1988]
[2751,"Hájek Martin","nezadán","bez","M",1988]
[2752,"Chalupecká Zdena","SK DG Chomutov","bez","M",1988]
[2753,"Vybíralík Vojtěch","KDG Tovačov","bez","M",1990]
[2754,"Hájek Ladislav","SK TEMPO Praha","bez","M",1975]
[2755,"Macho Pavel","DDM Praha 7","bez","S",1961]
[2756,"Riegerová Michaela","Start Kopřivnice",3,"Ju",1996]
[2757,"Malík Petr","SK TEMPO Praha","bez","M",1980]
[2758,"Čapková Vladimíra","nezadán","bez","Se",1955]
[2759,"Harant Milan","nezadán","bez","S2",1951]
[2760,"Nusková Zdena","nezadán","bez","Se",1966]
[2761,"Nusko Josef","nezadán","bez","S2",1951]
[2762,"Trojanová Jana","nezadán","bez","Se",1964]
[2763,"Trojan Václav","nezadán","bez","S2",1954]
[2764,"Topič Roman","KGB Kojetín","bez","M",1989]
[2765,"Vymětal Jaromír ml.","KGB Kojetín","bez","M",1989]
[2766,"Dvořák Daniel","1. DGC Bystřice p. H.",2,"M",1988]
[2767,"Černák Marek","MGC ´90 Brno","bez","M",1990]
[2768,"Handlová Simona","MGC ´90 Brno","M","Z",1990]
[2769,"Simandl Jan","MGC ´90 Brno","bez","M",1990]
[2770,"Barša Petr","MGC ´90 Brno","bez","M",1972]
[2771,"Svoboda Lukáš","MGC ´90 Brno","bez","M",1987]
[2772,"Souček Dušan","nezadán","bez","M",1979]
[2773,"Souček Pavel","SK TEMPO Praha",5,"M",1989]
[2774,"Bendová Veronika","MGC Plzeň","bez","Z",1985]
[2775,"Dostál Michal","KGB Kojetín","bez","M",1990]
[2776,"Koubský Adam","TJ UNEX Uničov","bez","J",1995]
[2777,"Kamarád Tomáš","TJ UNEX Uničov","bez","M",1980]
[2778,"Kadidlová Věra","MGC Jedovnice","bez","Se",1966]
[2779,"Lorenc Martin","TJ MG Cheb","bez","M",1968]
[2780,"Dočkal Tomáš","nezadán","bez","M",1981]
[2781,"Chalupa Tomáš","Minigolf club Vsetín","bez","M",1985]
[2782,"Metelka Radim","1. DGC Bystřice p. H.","bez","M",1989]
[2783,"Vašica Miroslav","1. DGC Bystřice p. H.","bez","M",1986]
[2784,"Zbránek Martin","SKDG Příbor",3,"M",1980]
[2785,"Valeš Milan","DGK Louny","bez","S2",1953]
[2786,"Polášek Jan","TJ Bystřice p. H.","bez","M",1987]
[2787,"Krejčí Jiří","MGC ´90 Brno","bez","M",1979]
[2788,"Petrášová Veronika","MGC ´90 Brno","bez","Z",1981]
[2789,"Fryšová Anna","SKGC Frant. Lázně",3,"Z",1993]
[2790,"Vorlíček Jan","DDM Praha 7","bez","J",1996]
[2791,"Hán Pavel","TJ Start Brno","bez","M",1989]
[2792,"Ernst Petr","KGB Kojetín","bez","M",1989]
[2793,"Poláková Pavla","DDM Praha 7","bez","Z",1992]
[2794,"Salač Petr","nezadán","bez","M",1990]
[2795,"Vlachopulos Radim","KDG Šternberk","bez","J",1996]
[2796,"Vlachopulos Tomáš","KDG Šternberk","bez","M",1992]
[2797,"Kratochvíl David","KDG Šternberk","bez","M",1992]
[2798,"Smejkal Marek","MGC Olomouc","M","M",1992]
[2799,"Jarský Marcel","MGC ´90 Brno","bez","M",1987]
[2800,"Kanea Jan","SK DG Chomutov","bez","S",1958]
[2801,"Dvořák Jan","KGB Kojetín","bez","M",1988]
[2802,"Gajdoš Jakub","KGB Kojetín","bez","M",1988]
[2803,"Chupáň Marek","KGB Kojetín","bez","M",1973]
[2804,"Janáček Robert","ME Blansko",4,"M",1988]
[2805,"Nakládal Luděk","MGC Holešov","bez","M",1988]
[2806,"Silný Jan","KGB Kojetín","bez","M",1989]
[2807,"Soldán David","KGB Kojetín","bez","M",1987]
[2808,"Hykel Vít","Start Kopřivnice","bez","M",1987]
[2809,"Vítek Tomáš","nezadán","bez","S",1967]
[2810,"Mendík Petr","nezadán","bez","M",1971]
[2811,"Šot František","MGC Jedovnice","bez","M",1985]
[2812,"Polach Jakub","KGB Kojetín","bez","M",1982]
[2813,"Procházka Jan","KGB Kojetín","bez","M",1984]
[2814,"Chupáň Petr","KGB Kojetín","bez","M",1970]
[2815,"Štefan Jan","KGB Kojetín","bez","M",1989]
[2816,"Vaněk Vladan","KGB Kojetín","bez","M",1989]
[2817,"Fríd Petr","SK TEMPO Praha",2,"S",1962]
[2818,"Hlinka Michal","Start Kopřivnice","bez","M",1991]
[2819,"Stančík Michal","MGC Olomouc",2,"M",1989]
[2820,"Havrda Lukáš","MGC Olomouc","bez","M",1989]
[2821,"Dostálek Pavel","MGT PLUPO Vratimov","bez","M",1971]
[2822,"Dostálková Alice","MGT PLUPO Vratimov","bez","Z",1974]
[2823,"Kocman Radim","MGC Jedovnice",2,"M",1989]
[2824,"Vyška Miroslav","ME Blansko",2,"M",1991]
[2825,"Koplík David","KGB Kojetín","bez","M",1988]
[2826,"Noha Jan","MGK Spartak Příbram","bez","M",1978]
[2827,"Zemánek Petr st.","KDG Tovačov","bez","M",1969]
[2828,"Karbus Petr","SK OAZA","bez","M",1977]
[2829,"Karbus Tomáš","SK OAZA","bez","M",1983]
[2830,"Dirn Marcel","nezadán","bez","M",1971]
[2831,"Křišťan Ivo","nezadán","bez","M",1972]
[2832,"Šimon Martin ing.","SK TEMPO Praha",3,"S",1956]
[2833,"Nečacký Milan","KGB Kojetín","bez","M",1988]
[2834,"Porschová Tereza","SK OAZA","bez","Z",1990]
[2835,"Zemánek Petr ml.","KDG Tovačov","bez","M",1989]
[2836,"Hlavinka Jiří","KGB Kojetín","bez","M",1987]
[2837,"Bierská Mlada","nezadán","bez","Se",1951]
[2838,"Bierski Radovan","MGC Polička","bez","M",1989]
[2839,"Černý Jakub","nezadán","bez","M",1990]
[2840,"Hána Miroslav","nezadán","bez","S",1956]
[2841,"Kubáň Radim","DDM Praha 7","bez","M",1991]
[2842,"Molendová Marie","nezadán","bez","Se",1947]
[2843,"Schön Václav","DDM Praha 7","bez","M",1991]
[2844,"Fantal Jakub","MGC Olomouc",2,"M",1989]
[2845,"Fantal Miroslav","MGC Olomouc","bez","M",1992]
[2846,"Fajmon Jiří","TJ Start Brno","bez","S2",1952]
[2847,"Fajmon Michal","TJ Start Brno","bez","M",1983]
[2848,"Hána Karel","nezadán","bez","S",1961]
[2849,"Hánová Anna","nezadán","bez","Se",1957]
[2850,"Havrlantová Vladimíra","nezadán","bez","Se",1964]
[2851,"Hlaváčová Renata","nezadán","bez","Se",1965]
[2852,"Honková Dagmar","nezadán","bez","Se",1960]
[2853,"Honková Tereza","KDG 2000 Ostrava","bez","Z",1989]
[2854,"Kocábová Lenka","nezadán","bez","Se",1965]
[2855,"Molenda Roman","nezadán","bez","M",1976]
[2856,"Korecký Petr","MGK Spartak Příbram","bez","M",1991]
[2857,"Škaloud Ondřej","GC 85 Rakovník","M","Jz",1998]
[2858,"Škaloud Vít","GC 85 Rakovník",2,"M",1992]
[2859,"Škaloudová Dita","GC 85 Rakovník",1,"Z",1969]
[2860,"Levová Kateřina","GC 85 Rakovník","bez","Z",1990]
[2861,"Lev David","GC 85 Rakovník","bez","J",1997]
[2862,"Rečka Michal","Start Kopřivnice","bez","M",1989]
[2863,"Bebejová Jaroslava","ME Blansko","bez","Z",1984]
[2864,"Pawlicová Eva","ME Blansko","bez","Z",1983]
[2865,"Rennerová Alena","ME Blansko","bez","Z",1976]
[2866,"Hrazdíra Petr","ME Blansko","bez","M",1974]
[2867,"Karnet Michal","ME Blansko","bez","M",1971]
[2868,"Broumská Irena","TJ MG Cheb",4,"Z",1968]
[2869,"Chládek Jiří","SKGC Frant. Lázně","bez","S",1955]
[2870,"Kocábová Hana","nezadán","bez","Se",1946]
[2871,"Chládková Monika","nezadán","bez","Se",1958]
[2872,"Bireš Jan ml.","nezadán","bez","M",1982]
[2873,"Hyspecký Martin","TJ MG Cheb","bez","M",1979]
[2874,"Doležel Radek ml.","MGC Holešov",2,"J",1995,"host. - 1. DGC Bystřice p.H."]
[2875,"Roubalík Zdeněk","MGC Holešov","bez","S2",1942]
[2876,"Novák Blahoslav","MGC Holešov","bez","S2",1946]
[2877,"Navrátil Lukáš","MGC Olomouc","bez","M",1993]
[2878,"Pospíšil Martin","MGC Olomouc","bez","M",1991]
[2879,"Radnicová Lenka","SK OAZA","bez","Z",1979]
[2880,"Satoranská Kateřina","SK TEMPO Praha","bez","Z",1975]
[2881,"Hradcová Hana","SK OAZA","bez","Z",1979]
[2882,"Hradec Milan","SK OAZA","bez","M",1977]
[2883,"Satoranský Milan","SK TEMPO Praha",3,"M",1976]
[2884,"Erbenová Martina","SK OAZA","bez","Z",1979]
[2885,"Tušek Vladimír","SK OAZA","bez","S",1956]
[2886,"Lišková Petra","SK TEMPO Praha","bez","Z",1978]
[2887,"Krčma Jakub","SK OAZA","bez","M",1990]
[2888,"Lundák David","SK OAZA","bez","M",1973]
[2889,"Skácel Radek","JR Golf Rychnov n. K.","bez","M",1978]
[2890,"Janichová Jitka","JR Golf Rychnov n. K.","bez","Z",1973]
[2891,"Nocar Pavel","MGC Plzeň","bez","M",1982]
[2892,"Míková Karolína","MGC Plzeň",2,"Z",1983]
[2893,"Medlík Lukáš","MG SEBA Tanvald","bez","M",1990]
[2894,"Medlík Miroslav","MG SEBA Tanvald","bez","S",1965]
[2895,"Olbrecht Karel","TJ Start Brno","bez","S",1957]
[2896,"Modlitba Zdeněk","KGB Kojetín","bez","M",1992]
[2897,"Přehnal Václav","KGB Kojetín","bez","M",1993]
[2898,"Dušek Radomír","KDG Šternberk","bez","M",1988]
[2899,"Dušek Jiří","MGC Olomouc","bez","M",1992]
[2900,"Šácha Daniel","Start Kopřivnice","bez","M",1988]
[2901,"Večerka Petr","KGB Kojetín","bez","M",1987]
[2902,"Dvořák Martin","KGB Kojetín","bez","M",1985]
[2903,"Janich Michal","MGC Olomouc",4,"M",1992]
[2904,"Chvostek David","KDG  VŠB-TU Ostrava","bez","M",1982]
[2905,"Pohajdová Alena","1. DGC Bystřice p. H.","bez","Se",1952]
[2906,"Miškechová Ludmila","1. DGC Bystřice p. H.","bez","Se",1954]
[2907,"Richterová Marie","1. DGC Bystřice p. H.","bez","Se",1958]
[2908,"Kučírek Ondřej","TJ Start Brno","bez","M",1993]
[2909,"Skoupý Michal","TJ Start Brno","bez","M",1989]
[2910,"Staněk Jiří","MGC Olomouc","M","J",1994]
[2911,"Nakládalová Jana","MGC ´90 Brno","M","Z",1990]
[2912,"Šustová Alena","ME Blansko",2,"Z",1988]
[2913,"Šustová Romana","KGB Kojetín","bez","Z",1989]
[2914,"Šauer Petr","MGC Polička","bez","S",1958]
[2915,"Olah Luděk","MG SEBA Tanvald",5,"M",1975]
[2916,"Chrastina Milan","KDG  VŠB-TU Ostrava","bez","M",1982]
[2917,"Skřivánek Jan","SK DG Chomutov","bez","M",1992]
[2918,"Zachová Marcela","SK DG Chomutov",3,"Se",1964]
[2919,"Ligačová Tereza","KGB Kojetín","bez","Z",1990]
[2920,"Kočička Karel","KGB Kojetín","bez","M",1988]
[2921,"Dvořák Petr","KGB Kojetín","bez","M",1988]
[2922,"Malý Pavel","KDG Šternberk","bez","M",1992]
[2923,"Král Josef","nezadán","bez","M",1993]
[2924,"Havlíček Zdeněk","KGB Kojetín","bez","M",1969]
[2925,"Bisaha Ondřej","KGB Kojetín","bez","M",1982]
[2926,"Kučera Lukáš","MGC Jedovnice",1,"M",1987]
[2927,"Pavlíková Petra","ME Blansko","bez","Z",1984]
[2928,"Kolář Jiří","MGC Jedovnice","bez","M",1989]
[2929,"Šebela Rostislav","MGC Jedovnice","bez","M",1992]
[2930,"Kolář Petr","MGC Jedovnice","bez","M",1988]
[2931,"Gelnar Ondřej","SKDG Příbor",2,"M",1992]
[2932,"Emmer Tomáš","MGC Plzeň",5,"M",1980]
[2933,"Hasch David","MGC Plzeň","bez","M",1978]
[2934,"Kratochvíl Zbyněk","MGC Plzeň","bez","M",1976]
[2935,"Kutra Radomil","MGC Holešov",5,"M",1988]
[2936,"Vasylevsky Nazar","TJ Start Brno","bez","M",1988]
[2937,"Skoupý Petr","ME Blansko",2,"S",1956]
[2938,"Kadidlo David","MGC Jedovnice","bez","J",1994]
[2939,"Šubertová Zuzana","SK TEMPO Praha","bez","Z",1979]
[2940,"Šklář Martin","nezadán","bez","M",1987]
[2941,"Roháčková Nikola","DDM Praha 7","bez","Z",1992]
[2942,"Taranda Martin","KDG 2000 Ostrava","bez","M",1984]
[2943,"Kociánová Lucie","DDM Praha 7","bez","Ju",1996]
[2944,"Doruška Petr","KDG 2000 Ostrava","bez","M",1987]
[2945,"Sniehottová Iva","MGT PLUPO Vratimov","bez","Z",1988]
[2946,"Šárský Vojtěch","MGT PLUPO Vratimov","bez","M",1991]
[2947,"Ješík Jaroslav","nezadán","bez","S",1965]
[2948,"Švrček Tomáš","MGT PLUPO Vratimov","bez","M",1989]
[2949,"Žákovská Šárka","nezadán","bez","Z",1981]
[2950,"Schreiber Václav","MGT PLUPO Vratimov","bez","J",1994]
[2951,"Waloszková Pavlína","MGT PLUPO Vratimov","bez","Z",1971]
[2952,"Modlík Martin","SKGC Frant. Lázně","bez","M",1985]
[2953,"Ambrová Marcela","SKGC Frant. Lázně","bez","Z",1981]
[2954,"Forgó Josef","SKGC Frant. Lázně","bez","M",1983]
[2955,"Zezula Zdeněk","KGB Kojetín","bez","M",1992]
[2956,"Zezula Jan","KGB Kojetín","bez","M",1992]
[2957,"Večerka Jan","KGB Kojetín","bez","M",1992]
[2958,"Tomášek Martin","MGC Olomouc","bez","M",1982]
[2959,"Šuková Věra","1. MGC Děkanka Praha",2,"Se",1953]
[2960,"Marko Ludvík","MGC Plzeň","bez","M",1985]
[2961,"Norek Bohumil","MGC Plzeň","bez","M",1985]
[2962,"Konupčík Radim","KDG  VŠB-TU Ostrava","bez","M",1979]
[2963,"Janeček Michal","JR Golf Rychnov n. K.","bez","M",1990]
[2964,"Šťasta Radek","MGC Holešov",5,"M",1987]
[2965,"Kutra Svatoslav","MGC Holešov","bez","M",1992]
[2966,"Dobrý Tomáš","KDG Šternberk","bez","M",1990]
[2967,"Hlaváč Otakar","MGC Olomouc","bez","M",1975]
[2968,"Rosenkranz Petr","KDG  VŠB-TU Ostrava","bez","M",1979]
[2969,"Svetková Jaroslava","SK DG Chomutov","bez","Se",1951]
[2970,"Krajčovič Adam","Start Kopřivnice","bez","M",1991]
[2971,"Volfová Jana","KGB Kojetín","bez","Z",1990]
[2972,"Karásek Pavel","DGK Louny","bez","M",1986]
[2973,"Cvešpr Martin","MGC Olomouc","bez","M",1992]
[2974,"Michalovič Jakub","MGC Plzeň","bez","M",1986]
[2975,"Michalovič Jan","MGC Plzeň","bez","M",1991]
[2976,"Petržela Zdeněk","SK Mlýn Přerov","bez","M",1989]
[2977,"Krafek Tomáš","SK Mlýn Přerov","bez","M",1990]
[2978,"Švarc Jakub","SK Mlýn Přerov","bez","M",1991]
[2979,"Vejtrubová Jaroslava","1. MGC Děkanka Praha","bez","Se",1964]
[2980,"Raška Pavel","SK Mlýn Přerov","bez","M",1991]
[2981,"Honskus Matěj","SMG 2000 Ústí n. L.","bez","M",1989]
[2982,"Honskus Filip","DDM Praha 7","bez","S",1964]
[2983,"Fafílek Aleš","SK Mlýn Přerov","bez","M",1992]
[2984,"Zlámal Radek","SK Mlýn Přerov","bez","M",1987]
[2985,"Hradílková Katka","SK Mlýn Přerov","bez","Z",1992]
[2986,"Bureš David","SK Mlýn Přerov","bez","M",1991]
[2987,"Komár Ivo","MGC Olomouc","bez","S2",1954]
[2988,"Němečková Šárka","nezadán","bez","Z",1980]
[2989,"Putík Vladimír","nezadán","bez","M",1978]
[2990,"Komínek Vladimír","SK Mlýn Přerov","bez","S",1966]
[2991,"Rejhonová Lenka","SK Mlýn Přerov","bez","Z",1972]
[2992,"Raška Tomáš","SK Mlýn Přerov","bez","M",1988]
[2993,"Raška Jaromír","SK Mlýn Přerov","bez","S",1961]
[2994,"Žůrek Vojtěch","SK Mlýn Přerov","bez","S2",1944]
[2995,"Žůrková Milada","SK Mlýn Přerov","bez","Se",1946]
[2996,"Zárubová Marcela","SK Mlýn Přerov","bez","Se",1940]
[2997,"Rachunková Martina","SK Mlýn Přerov","bez","Z",1991]
[2998,"Fryc Karel","SK Mlýn Přerov","bez","S2",1947]
[2999,"Homolová Martina","SMG 2000 Ústí n. L.","bez","Z",1972]
[3000,"Škurková Lenka","TJ Start Brno","bez","Z",1980]
[3001,"Skoupý Martin","ME Blansko",1,"M",1992]
[3002,"Holubová Jitka","SKDG Příbor","bez","Se",1965]
[3003,"Veřmirovský Milan","nezadán","bez","M",1971]
[3004,"Svobodová Ludmila","Start Kopřivnice","bez","Se",1953]
[3005,"Mikulenková Vladislava","Start Kopřivnice","bez","Z",1969]
[3006,"Melnarová Šárka","Start Kopřivnice","bez","Z",1977]
[3007,"Holubová Berta","SKDG Příbor","bez","Se",1930]
[3008,"Kladivová Ivana","nezadán","bez","Z",1974]
[3009,"Bis Filip","SK OAZA","bez","M",1978]
[3010,"Norek Bohumil","MGC Plzeň","bez","M",1985]
[3011,"Kubantová Lucie","SK DG Chomutov",5,"Z",1987]
[3012,"Dohnalová Monika","SK Mlýn Přerov","bez","Z",1990]
[3013,"Dohnalová Barbora","SK Mlýn Přerov","bez","Z",1993]
[3014,"Dohnalová Dagmar","SK Mlýn Přerov","bez","Se",1966]
[3015,"Dohnal František","SK Mlýn Přerov","bez","S",1965]
[3016,"Petrželová Marta","SK Mlýn Přerov","bez","Se",1963]
[3017,"Petržela Zdeněk","SK Mlýn Přerov","bez","S",1962]
[3018,"Kníže Katalin","GC 85 Rakovník",2,"Se",1962]
[3019,"Doležálek Adam","ME Blansko","M","J",1995]
[3020,"Bilíková Milena","SK Mlýn Přerov","bez","Se",1956]
[3021,"Bilík Milan","SK Mlýn Přerov","bez","S",1956]
[3022,"Kolářová Eva","SMG 2000 Ústí n. L.","bez","Z",1990]
[3023,"Zlámal Jan","KGB Kojetín","bez","M",1993]
[3024,"Janáček Jaroslav","KGB Kojetín","bez","S",1957]
[3025,"Krubner Jiří","JR Golf Rychnov n. K.","bez","J",1994]
[3026,"Prajer Jan","SMG 2000 Ústí n. L.","bez","M",1991]
[3027,"Veselák David","DGK Louny","bez","M",1993]
[3028,"Tietze Milan","MGT PLUPO Vratimov","bez","S",1961]
[3029,"Císař Ladislav","MGT PLUPO Vratimov","bez","M",1980]
[3030,"Rébl Miloslav","MGT PLUPO Vratimov","bez","S",1960]
[3031,"Zouna Jiří","SK TEMPO Praha","bez","M",1977]
[3032,"Bartošková Lucie","KGB Kojetín","bez","Z",1990]
[3033,"Hrabalík Aleš","MGC Polička","bez","M",1992]
[3034,"Kuthan Vít","MGC Plzeň","bez","M",1983]
[3035,"Kolář Petr","KDG  VŠB-TU Ostrava","bez","M",1980]
[3036,"Wolf Jakub","TJ MG Cheb",4,"M",1992]
[3037,"Komínek Miroslav","SK Mlýn Přerov","bez","M",1976]
[3038,"Zlámal Radoslav","SK Mlýn Přerov","bez","S",1961]
[3039,"Řezníček Pavel","Taurus Prostějov","bez","M",1968]
[3040,"Horn Vladimír","nezadán","bez","S",1963]
[3041,"Láska Tomáš","MGC Olomouc","bez","M",1992]
[3042,"Koller Miloslav","MGT PLUPO Vratimov","bez","M",1987]
[3043,"Fintes Zdeněk","MGT PLUPO Vratimov","bez","S",1959]
[3044,"Fintes Jan","MGT PLUPO Vratimov","bez","M",1991]
[3045,"Fintesová Jitka","MGT PLUPO Vratimov","bez","Se",1959]
[3046,"Fintesová Kateřina","MGT PLUPO Vratimov","bez","Z",1987]
[3047,"Bertels David","MGC Hradečtí Orli",3,"M",1991]
[3048,"Drbohlavová Veronika","MGC Hradečtí Orli",4,"Z",1992]
[3049,"Halvadžievová Kristýna","Taurus Prostějov","bez","Z",1992]
[3050,"Doleželová Markéta","Taurus Prostějov","bez","Z",1993]
[3051,"Wolf Jan","TJ MG Cheb",1,"M",1969]
[3052,"Holý Tomáš","JR Golf Rychnov n. K.","bez","M",1991]
[3053,"Skopový Petr","JR Golf Rychnov n. K.","bez","M",1991]
[3054,"Smolíková Marie","MGC Hradečtí Orli","bez","Z",1990]
[3055,"Tošovská Tereza","MGC Hradečtí Orli","bez","Z",1991]
[3056,"Baranová Barbora","MGT PLUPO Vratimov","bez","Z",1973]
[3057,"Baran Jakub","MGT PLUPO Vratimov","bez","M",1974]
[3058,"Vltavský Radek","MGT PLUPO Vratimov","bez","M",1980]
[3059,"Vráblíková Vladimíra","MGT PLUPO Vratimov","bez","Se",1960]
[3060,"Vráblík Josef","MGT PLUPO Vratimov","bez","S2",1950]
[3061,"Čechová Markéta","MGT PLUPO Vratimov","bez","Z",1987]
[3062,"Bodnár Petr","MGT PLUPO Vratimov","bez","M",1978]
[3063,"Sniehottová Kamila","MGT PLUPO Vratimov","bez","Se",1967]
[3064,"Miškechová Eva","1. DGC Bystřice p. H.","bez","Z",1978]
[3065,"Ječný Lukáš","SK TEMPO Praha","bez","Jz",2004]
[3066,"Luxa Radek","GC 85 Rakovník",2,"M",1975]
[3067,"Matoušů Martina","SK DG Chomutov","bez","Z",1992]
[3068,"Remiš Jiří","SK DG Chomutov","bez","S",1955]
[3069,"Broumská Hana","SK DG Chomutov","bez","Ju",1994]
[3070,"Petrů Martin","MGC Plzeň",4,"M",1990]
[3071,"Dvorník Tomáš","MGC Holešov","bez","M",1984]
[3072,"Libigerová Eva","SK TEMPO Praha","M","Z",1988]
[3073,"Mrázek Jiří","MGC Olomouc","bez","S2",1951]
[3074,"Čejka Jaroslav","SK OAZA",4,"S",1965]
[3075,"Skála Petr","Minigolf club Vsetín","bez","M",1977]
[3076,"Mejzlík Michal","ME Blansko","bez","M",1973]
[3077,"Němec Jakub","ME Blansko","bez","M",1992]
[3078,"Šebela Vít","MGC Jedovnice","bez","M",1991]
[3079,"Lux Jaromír","KGB Kojetín","bez","M",1987]
[3080,"Bednář Petr","MGC Hradečtí Orli",2,"M",1992]
[3081,"Bednář Martin","MGC Hradečtí Orli",1,"J",1994]
[3082,"Doleželová Alena","1. DGC Bystřice p. H.","M","Jza",1999]
[3083,"Valentová Martina","MGC Hradečtí Orli","bez","Z",1983]
[3084,"Hostašová Daniela","KDG Tovačov","bez","Z",1993]
[3085,"Dvorská Michaela","KDG Tovačov","bez","Z",1990]
[3086,"Richterová Kateřina","1. DGC Bystřice p. H.","bez","Z",1990]
[3087,"Tichá Andrea","MGC Holešov","bez","Z",1993]
[3088,"Roubalíková Dagmar","MGC Holešov",4,"Se",1967]
[3089,"Coufalíková Petra","SK Mlýn Přerov",4,"Z",1978]
[3090,"Richterová Radka","1. DGC Bystřice p. H.","bez","Z",1981]
[3091,"Vlček Marek","MGC Hradečtí Orli",2,"J",1994]
[3092,"Doležálek Vratislav","SK Mlýn Přerov","bez","S",1963]
[3093,"Sopko Jakub","Minigolf club Vsetín","bez","M",1990]
[3094,"Sodoma Kamil","JR Golf Rychnov n. K.","bez","M",1989]
[3095,"Dostálek Matouš","MGT PLUPO Vratimov","bez","J",1994]
[3096,"Škop Michal","MGT PLUPO Vratimov","bez","M",1992]
[3097,"Houžvová Veronika","MGT PLUPO Vratimov","bez","Z",1982]
[3098,"Pekárek Aleš","MGT PLUPO Vratimov","bez","M",1975]
[3099,"Kuchař Jan","MGT PLUPO Vratimov","bez","M",1981]
[3100,"Pekárková Zuzana","MGT PLUPO Vratimov","bez","Z",1979]
[3101,"Trvajová Miroslava","MGT PLUPO Vratimov","bez","Z",1979]
[3102,"Barbořík Libor","MGT PLUPO Vratimov","bez","M",1970]
[3103,"Salaj Miroslav","MGT PLUPO Vratimov","bez","S",1964]
[3104,"Salajová Petra","MGT PLUPO Vratimov","bez","Z",1972]
[3105,"Klimánek Vladimír","MGT PLUPO Vratimov","bez","S",1962]
[3106,"Pokorný Jiří","MGT PLUPO Vratimov","bez","S",1963]
[3107,"Pekárek Vadim","MGT PLUPO Vratimov","bez","M",1973]
[3108,"Lanča Věroslav","MGT PLUPO Vratimov","bez","S",1965]
[3109,"Zavadilová Romana","KGB Kojetín","bez","Z",1989]
[3110,"Ságnerová Lucie","MGC Holešov","bez","Z",1991]
[3111,"Jiráček Jan","SMG 2000 Ústí n. L.","bez","M",1993]
[3112,"Volná Tereza","MGT PLUPO Vratimov","bez","M",1988]
[3113,"Dostálová Jana","MGT PLUPO Vratimov","bez","Z",1988]
[3114,"Petrušová Lucie","MGT PLUPO Vratimov","bez","Z",1988]
[3115,"Pospíšil Ondřej","MGT PLUPO Vratimov","bez","M",1991]
[3116,"Fabián Michal","MGT PLUPO Vratimov","bez","M",1990]
[3117,"Tošenovjan Marek","MGT PLUPO Vratimov","bez","M",1990]
[3118,"Šimíková Kamila","MGT PLUPO Vratimov","bez","Z",1987]
[3119,"Nováčková Tereza","MGT PLUPO Vratimov","bez","Z",1989]
[3120,"Tlolková Magda","MGT PLUPO Vratimov","bez","Z",1990]
[3121,"Žižková Kristýna","MGT PLUPO Vratimov","bez","Z",1989]
[3122,"Cigánek Jakub","MGT PLUPO Vratimov","bez","M",1993]
[3123,"Kludková Martina","MGT PLUPO Vratimov","bez","Z",1990]
[3124,"Michenková Šárka","MGT PLUPO Vratimov","bez","Z",1989]
[3125,"Hrouzová Adéla","MGT PLUPO Vratimov","bez","Z",1991]
[3126,"Hrachovcová Petra","MGT PLUPO Vratimov","bez","Z",1988]
[3127,"Kokešová Petra","MGT PLUPO Vratimov","bez","Z",1989]
[3128,"Jedlicsková Petra","MGT PLUPO Vratimov","bez","Z",1988]
[3129,"Čaňo Jiří","MGT PLUPO Vratimov","bez","S",1960]
[3130,"Dubec Vít","MGT PLUPO Vratimov","bez","M",1990]
[3131,"Gazda Dalibor","MGT PLUPO Vratimov","bez","M",1974]
[3132,"Kmetová Andrea","MGT PLUPO Vratimov","bez","Z",1988]
[3133,"Němec Lukáš","MGT PLUPO Vratimov","bez","M",1974]
[3134,"Hurych Dominik","MGT PLUPO Vratimov","bez","M",1987]
[3135,"Čeladník Petr","1. DGC Bystřice p. H.",2,"M",1988]
[3136,"Janoušková Tereza","SK Mlýn Přerov","bez","Z",1980]
[3137,"Talašová Jitka","MGC Olomouc","bez","Z",1984]
[3138,"Olyšarová Růžena","SMG 2000 Ústí n. L.","bez","Se",1947]
[3139,"Rieger Petr","DDM Praha 7","bez","J",1994]
[3140,"Kolafa Vladimír","JR Golf Rychnov n. K.","bez","M",1993]
[3141,"Martinec Petr","JR Golf Rychnov n. K.","bez","M",1993]
[3142,"Hliněný Miroslav","JR Golf Rychnov n. K.","bez","M",1976]
[3143,"Neugebauerová Lenka","JR Golf Rychnov n. K.","bez","Z",1971]
[3144,"Neugebauer Josef","JR Golf Rychnov n. K.","bez","M",1968]
[3145,"Neugebauerová Klára","JR Golf Rychnov n. K.","bez","Z",1991]
[3146,"Bartošová Iva","JR Golf Rychnov n. K.","bez","Z",1989]
[3147,"Bartoš Petr","JR Golf Rychnov n. K.","bez","M",1992]
[3148,"Rejchrtová Iva","JR Golf Rychnov n. K.","bez","Se",1952]
[3149,"Gašparovič Vít","JR Golf Rychnov n. K.","bez","S2",1945]
[3150,"Ryšková Štěpánka","JR Golf Rychnov n. K.","bez","Se",1943]
[3151,"Ryška Jan","JR Golf Rychnov n. K.","bez","S2",1945]
[3152,"Ščučinský Petr","ME Blansko","bez","M",1980]
[3153,"Šuková Barbora","TJ MG Cheb","bez","Ju",1995]
[3154,"Šuková Magdalena","TJ MG Cheb","bez","Z",1990]
[3155,"Šuková Michaela","TJ MG Cheb","bez","Se",1965]
[3156,"Čegan Vlastimil","TJ MG Cheb","bez","S",1959]
[3157,"Zieczowski Oto","TJ MG Cheb","bez","M",1976]
[3158,"Hoffman Roman","SKGC Frant. Lázně","bez","J",1995]
[3159,"Němeček Karel","SKGC Frant. Lázně","bez","M",1989]
[3160,"Tolar David","SKGC Frant. Lázně","bez","M",1992]
[3161,"Sladká Anna","SKGC Frant. Lázně","bez","Se",1966]
[3162,"Musich Roman","SKGC Frant. Lázně","bez","S",1966]
[3163,"Martínek Pavel","SK Mlýn Přerov","bez","M",1991]
[3164,"Černý Patrik","MGT PLUPO Vratimov","bez","M",1975]
[3165,"Polák Vladimír","MGT PLUPO Vratimov","bez","M",1977]
[3166,"Matys Michal","MGT PLUPO Vratimov","bez","M",1979]
[3167,"Viktora David","MGT PLUPO Vratimov","bez","S",1967]
[3168,"Wysoglad Jan","MGT PLUPO Vratimov","bez","S",1956]
[3169,"Rataj Miroslav","MGT PLUPO Vratimov","bez","S2",1943]
[3170,"Filip Tomáš","MGT PLUPO Vratimov","bez","M",1973]
[3171,"Smrčka Jiří","MGT PLUPO Vratimov","bez","M",1973]
[3172,"Pajdla Martin","MGT PLUPO Vratimov","bez","M",1970]
[3173,"Šárská Michaela","MGT PLUPO Vratimov","bez","Se",1967]
[3174,"Poláková Marcela","MGT PLUPO Vratimov","bez","Z",1976]
[3175,"Cónová Anna","MGT PLUPO Vratimov","bez","Se",1954]
[3176,"Petrošová Lucie","MGT PLUPO Vratimov","bez","Z",1975]
[3177,"Decastellová Jana","1. MGC Děkanka Praha","bez","Se",1951]
[3178,"Kollárik Lukáš","Start Kopřivnice","bez","M",1987]
[3179,"Hálová Kateřina","SMG 2000 Ústí n. L.","bez","Z",1988]
[3180,"Adámek Martin","SK Mlýn Přerov","bez","M",1991]
[3181,"Krasula Stanislav","SK Mlýn Přerov","bez","M",1990]
[3182,"Steklý Miroslav ml.","MGC Hradečtí Orli","bez","J",1995]
[3183,"Berka Lukáš","MGC Hradečtí Orli","bez","M",1990]
[3184,"Votík Tomáš","SK OAZA",5,"M",1978]
[3185,"Toman Robin","Taurus Prostějov","bez","M",1991]
[3186,"Sekaninová Tereza","Taurus Prostějov","bez","Z",1983]
[3187,"Svobodová Karolína","MG SEBA Tanvald","bez","Z",1984]
[3188,"Kačer Jan","SK DG Chomutov","bez","J",1995]
[3189,"Kovář Josef","SK DG Chomutov",5,"J",1995]
[3190,"Luxová Barbora","KGB Kojetín","bez","Z",1990]
[3191,"Zelený Antonín","SK OAZA","bez","M",1975]
[3192,"Bazalová Eva","MGT PLUPO Vratimov","bez","Z",1983]
[3193,"Janeček Robert","JR Golf Rychnov n. K.","bez","J",1994]
[3194,"Kolafová Monika","JR Golf Rychnov n. K.","bez","Z",1973]
[3195,"Mizerová Eva","KGB Kojetín","bez","Z",1990]
[3196,"Benešová Aneta","MGC ´90 Brno","bez","Z",1990]
[3197,"Fanta Jiří","TJ MG Cheb","bez","S",1958]
[3198,"Nečekalová Vladimíra","TJ MG Cheb","bez","Z",1982]
[3199,"Černý Pavel","MGT PLUPO Vratimov","bez","M",1983]
[3200,"Krampera Vojtěch","MGK Spartak Příbram","bez","M",1978]
[3201,"Drozd Tomáš","Start Kopřivnice",3,"M",1991]
[3202,"Drozd Michal","Start Kopřivnice","bez","M",1991]
[3203,"Kopřivová Jitka","MGT PLUPO Vratimov","bez","Se",1962]
[3204,"Kopřiva Karel","MGT PLUPO Vratimov","bez","S",1961]
[3205,"Kopřiva Jan","MGT PLUPO Vratimov","bez","M",1987]
[3206,"Kopřivová Pavlína","MGT PLUPO Vratimov","bez","Z",1987]
[3207,"Holý Marek","MGT PLUPO Vratimov","bez","M",1979]
[3208,"Hrček Martin","MGT PLUPO Vratimov","bez","M",1976]
[3209,"Čaňo Jiří","MGT PLUPO Vratimov","bez","M",1984]
[3210,"Kania Ondřej","MGT PLUPO Vratimov","bez","M",1979]
[3211,"Čaňo Adam","MGT PLUPO Vratimov","bez","M",1988]
[3212,"Zoubková Lucie","MGT PLUPO Vratimov","bez","Z",1983]
[3213,"Kania Jindřich","MGT PLUPO Vratimov","bez","M",1982]
[3214,"Hnízdil Jakub","MGC Jedovnice","bez","M",1989]
[3215,"Arlt Milan","Minigolf club Vsetín","bez","M",1978]
[3216,"Jiráčková Pavlína","SMG 2000 Ústí n. L.","bez","Z",1969]
[3217,"Roubalík Petr","MGC Holešov",5,"S",1965]
[3218,"Rajhelová Zdeňka","MGC Olomouc","bez","Z",1992]
[3219,"Bednář Pavel","ME Blansko",3,"M",1988]
[3220,"Herentinová Ester","MGC Olomouc","bez","Z",1991]
[3221,"Balek Marcel","KDG 2000 Ostrava",5,"J",1994]
[3222,"Ježík Tomáš","KDG 2000 Ostrava","bez","J",1994]
[3223,"Doležílek Petr","KDG 2000 Ostrava","bez","J",1994]
[3224,"Strakošová Sára","KDG 2000 Ostrava","bez","Z",1993]
[3225,"Razima Martin","MGK Spartak Příbram","bez","M",1992]
[3226,"Zinke Lukáš","GC 85 Rakovník","bez","M",1992]
[3227,"Birešová Kateřina","SKGC Frant. Lázně","bez","Z",1990]
[3228,"Němec Arnošt","SKGC Frant. Lázně","bez","S",1965]
[3229,"Mašek Jaroslav","MGC Plzeň","bez","M",1983]
[3230,"Durček Jan","KDG 2000 Ostrava","bez","M",1991]
[3231,"Kabát Ondřej","KDG 2000 Ostrava","bez","J",1994]
[3232,"Trnka Vojtěch","KDG 2000 Ostrava","bez","M",1992]
[3233,"Hubinger Josef","MG České údolí Plzeň 3",4,"J",1994]
[3234,"Římská Michaela","TJ UNEX Uničov","bez","Ju",1996]
[3235,"Lakomý Hynek","TJ UNEX Uničov",5,"S",1960]
[3236,"Stejskalová Kateřina","TJ UNEX Uničov","bez","Z",1975]
[3237,"Svoboda Libor","TJ UNEX Uničov","bez","M",1969]
[3238,"Římská Hana","TJ UNEX Uničov","bez","Z",1976]
[3239,"Stejskalová Kateřina","TJ UNEX Uničov","bez","Jza",2000]
[3240,"Smatana Roman","JR Golf Rychnov n. K.","bez","M",1978]
[3241,"Bubeník Martin","SK TEMPO Praha",5,"M",1978]
[3242,"Mitera Pavel","SK TEMPO Praha","bez","M",1974]
[3243,"Švec Pavel","MGT PLUPO Vratimov","bez","M",1983]
[3244,"Mahrová Marie","KDG 2000 Ostrava","bez","Ju",1995]
[3245,"Čosičová Vesna","KDG 2000 Ostrava","bez","Z",1991]
[3246,"Čosič Rajko","KDG 2000 Ostrava","bez","M",1988]
[3247,"Zemlyakov Oleg","KDG 2000 Ostrava","bez","M",1988]
[3248,"Špačková Alžběta","Minigolf club Vsetín","bez","Z",1989]
[3249,"Šarközi Ondřej","MGC Holešov","bez","M",1993]
[3250,"Kutáč Martin","KDG Tovačov","bez","M",1992]
[3251,"Večerka Miroslav","KDG Tovačov","bez","M",1993]
[3252,"Možnar Radim","KDG Tovačov","bez","M",1993]
[3253,"Bubík Michal","MGC Holešov","bez","J",1996]
[3254,"Říha Michal","SK TEMPO Praha","M","M",1989]
[3255,"Trebichalská Lucie","MGC Hradečtí Orli","bez","Z",1993]
[3256,"Tučková Alexandra","MGC Hradečtí Orli","bez","Ju",1994]
[3257,"Kričfalušová Denisa","MGC Hradečtí Orli","bez","Ju",1994]
[3258,"Stříbrská Lucie","DGK Louny","bez","Z",1987]
[3259,"Zelenka Vladimír","SK DG Chomutov","bez","M",1974]
[3260,"Hradílek Adolf","SK Mlýn Přerov","bez","S2",1953]
[3261,"Hradílková Ladislava","SK Mlýn Přerov","bez","Se",1953]
[3262,"Houserková Jana","SK Mlýn Přerov","bez","Z",1974]
[3263,"Houserek Ivo","SK Mlýn Přerov","bez","M",1971]
[3264,"Krafková Jana","SK Mlýn Přerov","bez","Se",1961]
[3265,"Krafek Zdeněk","SK Mlýn Přerov","bez","S2",1946]
[3266,"Krasulová Kamila","SK Mlýn Přerov","bez","Z",1970]
[3267,"Rejhonová Hana","SK Mlýn Přerov","bez","Se",1943]
[3268,"Široká Ilona","SK Mlýn Přerov","bez","Se",1966]
[3269,"Brixelová Nikola","Taurus Prostějov","bez","Z",1985]
[3270,"Horáčková Sylvie","MGC Hradečtí Orli","bez","Ju",1994]
[3271,"Knoflíčková Simona","MGC Hradečtí Orli","bez","Ju",1994]
[3272,"Soukup Patrik","MGC Hradečtí Orli","bez","J",1997]
[3273,"Mikulecká Zdeňka","MGC Hradečtí Orli","bez","Se",1941]
[3274,"Macíček Jaroslav","SK Mlýn Přerov","bez","M",1991]
[3275,"Cimbálník Jakub","SK Mlýn Přerov","bez","J",1994]
[3276,"Rendlová Lenka","SKDG Fortuna Radotín",2,"Z",1981]
[3277,"Horák David","SMG 2000 Ústí n. L.","bez"]
[3278,"Kadaníková Pavla","MGC Hradečtí Orli",2,"Z",1992]
[3279,"Víšek Martin","SK OAZA",5,"M",1984]
[3280,"Řeháková Zuzana","SK TEMPO Praha",2,"Z",1987]
[3281,"Kleveta Ladislav","MGT PLUPO Vratimov","bez","M",1970]
[3282,"Zsigrai Miroslav","MGT PLUPO Vratimov","bez","M",1968]
[3283,"Hrstka David","MGC Holešov",4,"J",1997]
[3284,"Novák Matěj","1. DGC Bystřice p. H.",2,"J",1996]
[3285,"Žid Lukáš","JR Golf Rychnov n. K.","bez","J",1994]
[3286,"Svoboda Bohumil","MGC Olomouc",2,"S2",1952]
[3287,"Lépová Dobrunka","MGC Olomouc",1,"Se",1956]
[3288,"Cimbálník Pavel","SK Mlýn Přerov","bez","M",1972]
[3289,"Vyhnánek Leoš","MGT PLUPO Vratimov","bez","S",1960]
[3290,"Kosíková Marcela","MGT PLUPO Vratimov","bez","Se",1961]
[3291,"Kováč Kryštof","SK DG Chomutov","bez","Jz",1998]
[3292,"Pavelková Lucie","1. DGC Bystřice p. H.","M","Z",1993]
[3293,"Dybalová Iveta","Minigolf club Vsetín","bez","Z",1991]
[3294,"Pečivová Andrea","Minigolf club Vsetín","bez","Z",1992]
[3295,"Černý Tomáš","MGT PLUPO Vratimov","bez","Jz",2003]
[3296,"Černá Marie","MGT PLUPO Vratimov","bez","Z",1974]
[3297,"Jírová Lucie","MG SEBA Tanvald","bez","Z",1979]
[3298,"Dunger Kerstin","SKGC Frant. Lázně","bez","Se",1964]
[3299,"Stark Wolfgang","SKGC Frant. Lázně","bez","S2",1936]
[3300,"Neuhierl Christoph","SKGC Frant. Lázně","bez","S2",1940]
[3301,"Neuhierl Marlies","SKGC Frant. Lázně","bez","Se",1953]
[3302,"Tiekala Jakub","SKGC Frant. Lázně","bez","M",1991]
[3303,"Springerová Adéla","MGC Hradečtí Orli","bez","Ju",1994]
[3304,"Nikodém Vladimír","TJ MG Cheb","bez","S2",1948]
[3305,"Roupec Václav","TJ MG Cheb","bez","S",1964]
[3306,"Štantejský Miloš","TJ MG Cheb","bez","S",1962]
[3307,"Gabriel Zdeněk","TJ MG Cheb","bez","S",1956]
[3308,"Hošek Vladislav","TJ MG Cheb","bez","S2",1951]
[3309,"Šebesta Zdeněk","1. MGC Děkanka Praha",2,"S2",1951]
[3310,"Smuž Karel","MGT PLUPO Vratimov","bez","J",1995]
[3311,"Buček Pavel","SKDG Příbor",4,"S",1963]
[3312,"Klimek Tomáš","MGC Holešov",2,"J",1995]
[3313,"Solař Jiří","1. DGC Bystřice p. H.",2,"J",1995]
[3314,"Třetinová Markéta","Minigolf club Vsetín","bez","Z",1993]
[3315,"Jendruščák  Michal","MGC ´90 Brno","bez","M",1983]
[3316,"Chylek Michal","MGT PLUPO Vratimov","bez","M",1983]
[3317,"Bratovanov Petr","MGT PLUPO Vratimov","bez","M",1970]
[3318,"Jendruščák Roman","MGC ´90 Brno",4,"M",1990]
[3319,"Květoň Petr","MGC Plzeň",4,"M",1989]
[3320,"Jandová Karolína","1. DGC Bystřice p. H.","M","Ju",1994]
[3321,"Janda Roman","SK Mlýn Přerov",4,"S",1961,"host. - 1. DGC Bystřice p.H."]
[3322,"Jandová Jana","SK Mlýn Přerov","bez","Se",1966]
[3323,"Polášek Milan","GC 85 Rakovník","bez","S2",1952]
[3324,"Bílek Rudolf","TJ MG Cheb","bez","S",1957]
[3325,"Bláhová Jiřina","DGK Louny","bez","Z",1985]
[3326,"Schreiberová Vladislava","MGT PLUPO Vratimov","bez","Se",1949]
[3327,"Mrázek Adam","MGC Hradečtí Orli","bez","M",1992]
[3328,"Kadlčík David","MGT PLUPO Vratimov","bez","J",1994]
[3329,"Melichar Tomáš","JR Golf Rychnov n. K.","bez","M",1993]
[3330,"Karásek Jiří","TJ MG Cheb","bez","S2",1948]
[3331,"Burešová Daniela","TJ MG Cheb","bez","Z",1974]
[3332,"Bureš Tomáš","TJ MG Cheb",3,"M",1974]
[3333,"Doleželová Anna","1. DGC Bystřice p. H.","bez","Jza",2002]
[3334,"Bureš Daniel","TJ MG Cheb",4,"Jz",1999]
[3335,"Volf Milan","MGC Plzeň","bez","S2",1954]
[3336,"Břinda  Milan","MGC Plzeň","bez","S",1965]
[3337,"Šilhavý Lubor","MGC Plzeň","bez","M",1973]
[3338,"Zábranský Martin","KDG 2000 Ostrava",5,"J",1995]
[3339,"Soustružníková Věra","TJ MG Cheb","bez","Se",1947]
[3340,"Soustružníková Eva","TJ MG Cheb","bez","Z",1974]
[3341,"Placrová Zuzana","TJ MG Cheb",5,"Se",1953]
[3342,"Sassmannová Pavlína","TJ MG Cheb","bez","Se",1967]
[3343,"Pašek Josef","TJ MG Cheb",5,"M",1971]
[3344,"Placr Václav","TJ MG Cheb",2,"S2",1954]
[3345,"Fencl Hynek","SK TEMPO Praha","bez","J",1996]
[3346,"Novák  Ondřej","JR Golf Rychnov n. K.","bez","J",1997]
[3347,"Paleček Vladimír","JR Golf Rychnov n. K.","bez","J",1994]
[3348,"Malachta Radek","TJ Start Brno",4,"M",1993]
[3349,"Jeřábek Vojtěch","TJ Start Brno","bez"]
[3350,"Šupler Petr","TJ Start Brno","bez","M",1983]
[3351,"Blažková Ema","MGC Olomouc","M","Ju",1995]
[3352,"Rychlík Milan","KDG 2000 Ostrava",3,"S2",1954]
[3353,"Proška Jiří","SK Mlýn Přerov",5,"J",1994]
[3354,"Kuštein David","SK Mlýn Přerov","bez","J",1995]
[3355,"Racek Pavel","SK Mlýn Přerov","bez","M",1992]
[3356,"Slámová Alžběta","MGT PLUPO Vratimov","bez","Ju",1994]
[3357,"Vejražková Soňa","TJ MG Cheb","bez","Jza",1998]
[3358,"Bukovjan Daniel","TJ MG Cheb","bez","Jz",1998]
[3359,"Lojka Jakub","TJ MG Cheb",4,"Jz",1998]
[3360,"Lojka Michal","TJ MG Cheb",2,"J",1994]
[3361,"Naď Dušan","TJ MG Cheb","bez","M",1980]
[3362,"Toman Lukáš","TJ MG Cheb",4,"M",1989]
[3363,"Kopecká Veronika","SKGC Frant. Lázně","bez","Z",1992]
[3364,"Vašák Miroslav","TJ MG Cheb","bez","M",1980]
[3365,"Juklíčková Petra","TJ MG Cheb","bez","Z",1980]
[3366,"Lojka Karel","TJ MG Cheb","bez","M",1971]
[3367,"Liška Václav","TJ MG Cheb","bez","M",1981]
[3368,"Talaš Petr","H - minigolf club Grygov","bez","M",1982]
[3369,"Mihál Lukáš","H - minigolf club Grygov","bez","M",1980]
[3370,"Talašová Jana","H - minigolf club Grygov","bez","Se",1961]
[3371,"Talašová Kateřina","H - minigolf club Grygov","bez","Z",1982]
[3372,"Žurková Silvie","H - minigolf club Grygov","bez","Z",1974]
[3373,"Stareček Jaromír","H - minigolf club Grygov","bez","S",1955]
[3374,"Žurek Roman","H - minigolf club Grygov","bez","M",1970]
[3375,"Pargáčová Vlasta","Start Kopřivnice",1,"Se",1958]
[3376,"Šmída Jan","MGC Hradečtí Orli","bez","J",1994]
[3377,"Staněk Jan","GC 85 Rakovník","bez","S",1963]
[3378,"Staněk Jan ml.","GC 85 Rakovník","bez","M",1993]
[3379,"Ludačková Blanka","GC 85 Rakovník","bez","Z",1982]
[3380,"Lisová Eliška","SKDG Jesenice","bez","Ju",1997]
[3381,"Lisa Vojtěch","SKDG Jesenice","bez","J",1996]
[3382,"Jiroušek Michal","SKDG Jesenice","bez","J",1997]
[3383,"Dicse Vojtěch","SKDG Jesenice","bez","J",1994]
[3384,"Skočil David","TJ MG Cheb","bez","M",1971]
[3385,"Skočil Daniel","TJ MG Cheb","bez","J",1997]
[3386,"Vrba David","MGC ´90 Brno","bez","J",1996]
[3387,"Gala Lukáš","MGC ´90 Brno","bez","M",1991]
[3388,"Král Roman  ml.","MGC ´90 Brno",1,"J",1994]
[3389,"Rychlíková Zuzana","KDG 2000 Ostrava","bez","Z",1982]
[3390,"Tračík Josef","KDG 2000 Ostrava","bez","M",1979]
[3391,"Krejčíčková Klára","MGT PLUPO Vratimov","bez","Z",1989]
[3392,"Táborský Petr","MGT PLUPO Vratimov","bez","M",1992]
[3393,"Adámková Lenka","MGT PLUPO Vratimov","bez","Z",1990]
[3394,"Siuda Jiří","MGT PLUPO Vratimov","bez","M",1989]
[3395,"Parwa Martin","MGT PLUPO Vratimov","bez","M",1992]
[3396,"Machala Petr","SKDG Příbor",2,"M",1975]
[3397,"Juroszek Jan","MGC Holešov",1,"J",1997]
[3398,"Bětíková Ludvika","MGC Olomouc",1,"Z",1979]
[3399,"Sedláček Dan","MGC Opava","bez","M",1992]
[3400,"Král Roman st.","MGC ´90 Brno",3,"S",1963]
[3401,"Gala  Jakub","MGC ´90 Brno","bez","J",1996]
[3402,"Blažek Lubomír","TJ UNEX Uničov","bez","M",1978]
[3403,"Polišenský Tomáš","MGC Holešov","bez","J",1994]
[3404,"Jindráková Miloslava","1. MGC Děkanka Praha","bez","Se",1959]
[3405,"Bednářová Lucie","1. MGC Děkanka Praha","bez","Z",1977]
[3406,"Hochmal Aleš","JR Golf Rychnov n. K.","bez","J",1997]
[3407,"Šklíba Jakub","MGC Hradečtí Orli","bez","J",1996]
[3408,"Pazderka Michal","MGC Hradečtí Orli",2,"J",1996]
[3409,"Jakl Zbyněk","MGC Hradečtí Orli","bez","J",1996]
[3410,"Waligorová Tereza","MGC Opava","bez","Z",1993]
[3411,"Eliášová Lucie","MGC Plzeň","bez","Z",1983]
[3412,"Froněk Jaroslav","GC 85 Rakovník","bez","J",1996]
[3413,"Králová Blanka","MGC ´90 Brno","bez","Z",1988]
[3414,"Gardáš Jan","MGC ´90 Brno",4,"J",1995]
[3415,"Volf Lukáš","MGC Plzeň","bez","M",1984]
[3416,"Kvíz Václav","SK DG Chomutov","bez","J",1994]
[3417,"Kasková Alice","žádný","bez","Z",1969]
[3418,"Pohajda Ondřej","TJ UNEX Uničov","bez","J",1994]
[3419,"Průcha Petr","TJ MG Cheb",3,"S2",1948]
[3420,"Mikulecká Alina","MGC Hradečtí Orli","bez","Ju",1997]
[3421,"Tóth David","MGC Hradečtí Orli","bez","J",1996]
[3422,"Kabát Jaroslav","SKGC Frant. Lázně","bez","J",1994]
[3423,"Ryklík Petr","SKGC Frant. Lázně","bez","J",1997]
[3424,"Vídenský Roman","SKGC Frant. Lázně","bez","J",1994]
[3425,"Křemen Jan","SKGC Frant. Lázně","bez","Jz",2000]
[3426,"Himerová Vendula","MGT PLUPO Vratimov","bez","Z",1981]
[3427,"Bittner Jan","SKDG Příbor","bez","M",1976]
[3428,"Šípek Jan","MGC Holešov","bez","M",1987]
[3429,"Pätoprstý Milan","MGK Adara Radějov","bez","M",1975]
[3430,"Tarandová Lenka","MGK Adara Radějov","bez","Z",1987]
[3431,"Derzsi Ladislav","ŠK Adara Trnava (SK)","bez","M",1979]
[3432,"Palovič Juraj","ŠK Adara Trnava (SK)","bez","M",1983]
[3433,"Paytina Ján","MGK Adara Radějov","bez","M",1981]
[3434,"Meszárosová Veronika","MGK Adara Radějov","bez","Z",1984]
[3435,"Do Minh Hieu","MGC Holešov","bez","Jz",2000]
[3436,"Procházka Jan","MGC Holešov","bez","J",1996]
[3437,"Hudec Jan","1. DGC Bystřice p. H.","bez","J",1997]
[3438,"Kadidlo Pavel","MGC Jedovnice","bez","J",1997]
[3439,"Loukota Petr","MGC Jedovnice","bez","M",1989]
[3440,"Halíř Jiří","KDG Tovačov",5,"J",1995]
[3441,"Jurek Dominik","KDG Tovačov","bez","J",1994]
[3442,"Patočka Jan","KDG Tovačov","bez","J",1995]
[3443,"Vybíral Petr","KDG Tovačov","bez","Jz",1998]
[3444,"Kohnová Sára","KDG Tovačov","bez","Ju",1996]
[3445,"Krvačná Pavlína","KDG Tovačov","bez","Ju",1996]
[3446,"Rychlík Milan","KDG 2000 Ostrava","bez","M",1977]
[3447,"Dvorník Martin","MGC Holešov","bez","J",1997]
[3448,"Nguyen Tat Anh Tuan","MGC Holešov",5,"J",1996]
[3449,"Bednář Pavel","MGC ´90 Brno","bez","M",1981]
[3450,"Dlab Michal","MGC Hradečtí Orli",3,"J",1996]
[3451,"Exner Zbyněk","MGC Hradečtí Orli",1,"J",1996]
[3452,"Ouředník Petr","SK TEMPO Praha",4,"M",1970]
[3453,"Krupičková Iveta","TJ Start Brno","bez","Z",1985]
[3454,"Krása Radek","TJ MG Cheb","bez","M",1989]
[3455,"Košnar Karel","GC 85 Rakovník","bez","S",1963]
[3456,"Beňuš Radek","nezadán","bez","M",1972]
[3457,"Marešová Hana","nezadán","bez","Z",1978]
[3458,"Polák Martin","nezadán","bez","M",1969]
[3459,"Kotlárová Irena","nezadán","bez","Z",1968]
[3460,"Kelarová Markéta","nezadán","bez","Z",1971]
[3461,"Danihelová Monika","nezadán","bez","Z",1971]
[3462,"Bruckner Jaromír","nezadán","bez","S",1960]
[3463,"Podhajská Lenka","nezadán","bez","Z",1986]
[3464,"Kociánová Marie","nezadán","bez","Se",1957]
[3465,"Škubala Ladislav","nezadán","bez","S",1963]
[3466,"Hub Jiří","nezadán","bez","M",1983]
[3467,"Steinitz Radek","nezadán","bez","M",1968]
[3468,"Zjavka Michal","nezadán","bez","M",1984]
[3469,"Mraček Jan","KDG Tovačov","bez","Jz",2001]
[3470,"Odvárka Petr","SKDG Příbor",2,"J",1994]
[3471,"Samešová Karolina","MGC Hradečtí Orli","bez","Ju",1997]
[3472,"Csontos Michal","ŠK Adara Trnava (SK)","bez","M",1985]
[3473,"Ištván Michal","ŠK Adara Trnava (SK)","bez","M",1982]
[3474,"Karásek Jiří","1. MGC Děkanka Praha","bez","M",1977]
[3475,"Malárik Michal","SKGC Frant. Lázně",1,"J",1995]
[3476,"Hubingerová Barbora","MGC Plzeň","bez","Ju",1996]
[3477,"Drábeček Karel","MGC Plzeň","bez","J",1997]
[3478,"Hajdušková Hana","Start Kopřivnice","bez","Ju",1996]
[3479,"Ďurneková Ludmila","TJ MG Cheb","bez","Se",1967]
[3480,"Hemplová Lenka","TJ MG Cheb","bez","Se",1967]
[3481,"Slavíková Kristýna","TJ MG Cheb","bez","Ju",1996]
[3482,"Zimmel Karel","TJ MG Cheb","bez","M",1984]
[3483,"Hamar Jan","TJ MG Cheb","bez","J",1994]
[3484,"Málková Daniela","TJ MG Cheb","bez","Z",1970]
[3485,"Střelec Jindřich","TJ MG Cheb","bez","S",1965]
[3486,"Kašpar František","TJ MG Cheb","bez","S",1961]
[3487,"Strnadová Alexandra","TJ MG Cheb","bez","Se",1964]
[3488,"Smilková Jitka","MGC Dragon Pelhřimov","bez","Z",1981]
[3489,"Raus Aleš","MGC ´90 Brno","bez","M",1976]
[3490,"Petr František","MGC Holešov","bez","J",1996]
[3491,"Vomela Vladimír","TJ MG Cheb","bez","S",1967]
[3492,"Köhler Tomáš","TJ Start Brno","bez","Jz",1998]
[3493,"Forst Martin","SKGC Frant. Lázně","bez","Jz",1998]
[3494,"Rusakov Nikola","SKGC Frant. Lázně","bez","J",1996]
[3495,"Babič Marcel","1. MGC Děkanka Praha","bez","S",1957]
[3496,"Švanda Ondřej","MGC Polička",4,"Jz",2003]
[3497,"Buček Vladimír","SKDG Příbor","bez","S",1965]
[3498,"Leitner Václav","MGC Holešov","bez","S",1963]
[3499,"Švanda Adam","MGC Polička",5,"Jz",2005]
[3500,"Šebela David","MGC Jedovnice","bez","Jz",2009]
[3501,"Placrová Lenka","TJ MG Cheb","bez","Z",1980]
[3502,"Jakubík Michael","TJ MG Cheb","bez","M",1979]
[3503,"Bednář Otakar","MGC Hradečtí Orli",3,"S2",1950]
[3504,"Janečková Linda","MGC Hradečtí Orli","bez","Jza",1999]
[3505,"Rous Adam","MGC Hradečtí Orli",1,"J",1997]
[3506,"Nečekalová Jolana","TJ MG Cheb","bez","Jza",2009]
[3507,"Píšová Hana","SK TEMPO Praha",3,"Z",1987]
[3508,"Řezníčková Aneta","MGC Dráčata Pečky","bez","Jza",1998]
[3509,"Vrzal Martin","MGC Dráčata Pečky",4,"Jz",1999]
[3510,"Vais Vojta","MGC Dráčata Pečky",4,"Jz",1999]
[3511,"Svoboda Dominik","MGC Dráčata Pečky",5,"Jz",2000]
[3512,"Mráz Aleš","MGC Dráčata Pečky","bez","Jz",2001]
[3513,"Labonek Pavel","MGC Olomouc","bez","S2",1953]
[3514,"David Tomáš","MGC Olomouc",3,"J",1995]
[3515,"Foretník Štěpán","MGC ´90 Brno",2,"S",1958]
[3516,"Smrček Jaromír","MGC ´90 Brno","bez","M",1984]
[3517,"Šelepa Jan","MGC ´90 Brno",2,"M",1983]
[3518,"Flandera Jaroslav","KDG 2000 Ostrava","bez","M",1989]
[3519,"Štička Dalibor","GC 85 Rakovník",4,"S",1960]
[3520,"Vladimír Pokorný","MG SEBA Tanvald","bez","M",1987]
[3521,"Fiedlerová Jana","SKGC Frant. Lázně",2,"Z",1984]
[3522,"Rous Kamil","MGC Hradečtí Orli",1,"M",1972]
[3523,"Horák Martin","MGC ´90 Brno","bez","J",1997]
[3524,"Pivec Jan","SKDG Fortuna Radotín","bez","M",1987]
[3525,"Maňásková Anna","KDG 2000 Ostrava","bez","Ju",1997]
[3526,"Smola Vladimír","Akademie Minigolfu","bez","M",1976]
[3527,"Vacková Aneta","Akademie Minigolfu","bez","Jza",1999]
[3528,"Chroust Karel","Akademie Minigolfu","bez","J",1997]
[3529,"Pačes Michal","Akademie Minigolfu","bez","Jz",1999]
[3530,"Janoch Lukáš","Akademie Minigolfu","bez","J",1997]
[3531,"Hrabal Petr","KDG 2000 Ostrava","bez","M",1975]
[3532,"Toman Jiří","Start Kopřivnice","M","J",1997]
[3533,"Nováková Nikola","MGC Olomouc",5,"Ju",1997]
[3534,"Květoňová Magdalena","MGC Plzeň","bez","Jza",1998]
[3535,"Kadlecová Eva","TJ MG Cheb",4,"Z",1971]
[3536,"Kadlec Jan","TJ MG Cheb",2,"Jz",1999]
[3537,"Kodat Petr","TJ MG Cheb","bez","M",1979]
[3538,"Svoboda Boris","TJ MG Cheb",1,"Jz",1998]
[3539,"Hnilička Tomáš","SK DG Chomutov","bez","Jz",2000]
[3540,"Kolek Jakub","MGC Dráčata Pečky",3,"Jz",2001]
[3541,"Kropáčová Simona","MGC Olomouc","bez","Jza",2001]
[3542,"Sofka Dušan","1. MGC Děkanka Praha",2,"S",1966]
[3543,"Sofková Michaela","1. MGC Děkanka Praha",5,"Z",1971]
[3544,"Schubert Vojtěch","MGC Olomouc","bez","Jz",2002]
[3545,"Jahn Tomáš","KDG 2000 Ostrava","bez","M",1975]
[3546,"Martin Koza","MGC Hradečtí Orli","bez","Jz",2000]
[3547,"Mrňávková Nikola","MGC Hradečtí Orli","bez","Jza",1999]
[3548,"Urbánek Lukáš","MGC Dráčata Pečky","bez","Jz",1999]
[3549,"Bulan Pavel","MGC Dráčata Pečky","bez","Jz",1998]
[3550,"Bílková Kateřina","TJ MG Cheb","bez","Jza",2002]
[3551,"Tvrdý Jan","TJ MG Cheb",2,"M",1992]
[3552,"Kocum Ondřej","TJ MG Cheb",3,"M",1992]
[3553,"Šmoldasová Dominika","1. DGC Bystřice p. H.",4,"Ju",1997]
[3554,"Novák Petr","KDG 2000 Ostrava",3,"S",1964]
[3555,"Studnička Petr","KDG 2000 Ostrava",3,"S",1965]
[3556,"Ambrož Petr","KDG 2000 Ostrava","bez","M",1990]
[3557,"Nezval Marek","MGC Jedovnice","bez","Jz",2000]
[3558,"Čech Matěj","SKDG Fortuna Radotín","bez","Jz",2003]
[3559,"Kala Radek","TJ Start Brno","bez","M",1969]
[3560,"Tomášek Petr","MG České údolí Plzeň 3","bez","M",1970]
[3561,"Šebej-Koval Martin","MG České údolí Plzeň 3","bez","M",1986]
[3562,"Myšák Ondřej","SKDG Příbor",2,"J",1995]
[3563,"Krompolc Martin","SKDG Příbor","bez","J",1995]
[3564,"Čižmár Michal","SKDG Příbor",2,"Jz",1999]
[3565,"Masopust Tomáš","SKDG Příbor","bez","Jz",2001]
[3566,"Krumhanzl Daniel","GC 85 Rakovník","bez","M",1975]
[3567,"Krumhanzlová Gabriela","GC 85 Rakovník","bez","Jza",2003]
[3568,"Holčíková Jana","MG SEBA Tanvald",1,"Jza",1999]
[3569,"Ognarová Krystýna","MG SEBA Tanvald",1,"Jza",2001]
[3570,"Maňaska Michal","MGC Jedovnice","bez","M",1983]
[3571,"Ondroušek Josef","MGC Olomouc","bez","Jz",1998]
[3572,"Ondroušek Jakub","MGC Olomouc","bez","Jz",2004]
[3573,"Tupá Magdalena","SKDG Fortuna Radotín",5,"Z",1982]
[3574,"Pazderková Julie","MGC Dragon Pelhřimov",4,"Z",1991]
[3575,"Mařík Johan","MG České údolí Plzeň 3","bez","J",1994]
[3576,"Borovička Jakub","MGC Dráčata Pečky","bez","Jz",2002]
[3577,"Crkal Šimon","MGC Dráčata Pečky","bez","Jz",2003]
[3578,"Kadlec Jiří","MGC Hradečtí Orli",5,"Jz",2000]
[3579,"Bertels Dominik","MGC Hradečtí Orli",4,"Jz",1998]
[3580,"Peřina Adam","MGC Olomouc","bez","Jz",2003]
[3581,"Bašus Martin","MGC Dráčata Pečky","bez","Jz",2001]
[3582,"Dvořák Dominik","KDG Tovačov","bez","J",1996]
[3583,"Kulhánková Tereza","KDG Tovačov","bez","Jza",2002]
[3584,"Partyková Aneta","KDG Tovačov",5,"Jza",2002]
[3585,"Pavlovčinová Zuzana","KDG Tovačov","bez","Jza",2002]
[3586,"Smolka David","KDG Tovačov",5,"M",1973]
[3587,"Smolka Jakub","KDG Tovačov","bez","Jz",2002]
[3588,"Šimek Jaromír","KDG Tovačov","bez","M",1984]
[3589,"Hyspecká Kateřina","TJ MG Cheb","bez","Z",1982]
[3590,"Bláha Michal","MG SEBA Tanvald",5,"M",1992]
[3591,"Pernický Marcel","KDG 2000 Ostrava","bez","M",1970]
[3592,"Kellnerová Jana","KDG 2000 Ostrava","bez","Z",1975]
[3593,"Hawranek Vojtěch","KDG 2000 Ostrava","bez","M",1993]
[3594,"Truněček Martin","MGC Hradečtí Orli","bez","Jz",2004]
[3595,"Drozda Matouš","SK DG Chomutov","bez","Jz",2008]
[3596,"Bukovjan Milan","MG SEBA Tanvald",5,"Jz",2000]
[3597,"Štěpánek Jan","MGC Hradečtí Orli","bez","Jz",2000]
[3598,"Čejková Lucie","MG SEBA Tanvald","bez","J",1995]
[3599,"Lehártová Daniela","SK OAZA","bez","Z",1987]
[3600,"Kovář Jan","SK OAZA","bez","M",1985]
[3601,"Bajor Rostislav","KDG 2000 Ostrava",5,"S",1965]
[3602,"Zontág Lubomír","1. DGC Bystřice p. H.",1,"M",1990]
[3603,"Čibik Miroslav","1. DGC Bystřice p. H.","M","J",1994]
[3604,"Kočí Jakub","MGC Olomouc","bez","M",1983]
[3605,"Kočíb Antonín","MGC Olomouc","bez","S2",1942]
[3606,"Sůsa Richard","Akademie Minigolfu","bez","Jz",1998]
[3607,"Zika Zdeněk","DG Fortuna Radotín","bez","M",1974]
[3608,"Kalousek Jan","DG Fortuna Radotín","bez","Jz",2002]
[3609,"Vaňová Kateřina","DG Fortuna Radotín","bez","Jza",2004]
[3610,"Crkal Miloš","MGC Dráčata Pečky","bez","M",1973]
[3611,"Bergerová Patricie","MG SEBA Tanvald","bez","Jza",1998]
[3612,"Pavlata Miroslav","SKDG Chomutov","bez","S",1953]
[3613,"Pavlata Tomáš","SKDG Chomutov","bez","M",1982]
[3614,"Marek Lukáš","KDG 2000 Ostrava","bez","Jz",1997]
[3615,"Bartoš Andrzej","MGC Rajhrad","bez","M",1981]
[3616,"Bartošová Sylvie","MGC Rajhrad","bez","Z",1982]
["SK265","Struhár Radovan","1.MGCT Prievidza (SK)","bez","J",1995]
["SK003","Bartoš Matěj","ŠK Adara Trnava (SK)","bez","J",1994]
["SK005","Zontág Lubomír","1. DGC Bystřice p. H.","bez","M",1990]
["SK006","Šimanský René","ŠK Adara Trnava (SK)","bez","M",1968]
["SK007","Putnoky Michal","ŠK Adara Trnava (SK)","bez","S",1960]
["SK115","Palovič Juraj","ŠK Adara Trnava (SK)","bez","M",1989]
["SK147","Derzsi Ladislav","ŠK Adara Trnava (SK)","bez","M",1979]
["SK204","Csontos Michal","ŠK Adara Trnava (SK)","bez","M",1982]
["SK207","Ištván Michal","ŠK Adara Trnava (SK)","bez","M",1985]
["SK217","Drgoň František","ŠK Adara Trnava (SK)","bez","S"]
["SK224","Bubelíny Peter","ŠK Adara Trnava (SK)","bez","M",1983]
["SK243","Havlík Marián","GK Bratislava (SK)","bez","M"]
["SK257","Čibik Miroslav","1. DGC Bystřice p. H.","bez","J",1994]
["SK279","Roemer Ivan","ŠK Adara Trnava (SK)","bez","S",1959]
["SK300","Kalník Jan","GK Bratislava (SK)","bez","M"]
["SK301","Gróf Marco","1.MGCT Prievidza (SK)","bez","J"]
["SK302","Videnová Veronika","ŠK Adara Trnava (SK)","bez","Z"]
["PL001","Mateusz Miloch","MC Sopot (PL)","bez","M",1992]
["A001","Danner Martina","Linz (A)","bez","Ju"]
["A002","Leichtfried Philip","Alt-ErLaa (A)","bez","J"]
["A003","Inmann Günter","UBGC Dornbirn (A)","bez","M"]
["A004","Steffenhagen Christine","Polizei SV Steyr (A)"]
["DE001","Schwarz Günter","Polizei SV Steyr (A)","bez","S"]